program: Orca
programVersion: 5.0.3
charge: 1
multiplicity: 1
keywords: DLPNO-CCSD(T1) tightPNO Extrapolate(3/4,def2) RIJK def2/JK verytightSCF miniprint nopop
formula: C8H13
InChI: InChI=1/C8H13/c1-2-4-6-8-7-5-3-1/h1-2,7H,3-6,8H2
21 atoms
C  -1.992649 0.547129 0.114293
H  -2.168165 0.733518 1.177851
C  -1.905371 -0.982192 -0.174544
H  -2.669675 -1.555368 0.355098
C  -0.487066 -1.216335 0.307058
C  0.624869 -1.174847 -0.482459
C  1.91625 -0.670971 0.070846
H  2.038667 -0.949695 1.122861
H  2.782061 -1.040381 -0.486759
C  1.861597 0.888062 -0.061556
H  1.944877 1.163549 -1.119729
H  2.71303 1.341615 0.453373
C  0.533711 1.473352 0.504251
C  -0.600501 0.970957 -0.292273
H  0.53319 -1.308516 -1.560328
H  -1.994523 -1.180327 -1.247301
H  0.404001 1.283295 1.573845
H  -0.466092 1.07022 -1.372934
H  -2.763579 1.056273 -0.475271
H  0.582202 2.569036 0.365136
H  -0.344612 -1.181897 1.388821
e0: -310.316088978 hartree
corrType: DLPNO BASED
e0: -310.329709414 hartree
basis: def2-TZVPP def2-QZVPP
scfener: -310.316088978 -310.329709414
corrmethod: MDCI MDCI
correner: -1.449371075 -1.519645533
corrcbsextra: -1.571700647
energy: -311.903286122085
dipole: 0.55419 -0.97549 -0.42130 1.87342 -1.22113 0.65229 0.16350 -0.35549 -0.19199
magnitude: 0.79990 au
magnitude: 2.03318 debye
