program: Orca
programVersion: 5.0.3
elementType: C H C H C C C H H C H H C C H H H H H H H
charge: 1
multiplicity: 1
keywords: PBE0 def2-TZVP EnGrad D3BJ RIJCOSX verytightscf def2/J soscf
formula: C8H13
InChI: InChI=1/C8H13/c1-2-4-6-8-7-5-3-1/h1-2,7H,3-6,8H2
21 atoms
C  -1.998116 0.518565 0.10349
H  -2.186623 0.741145 1.157084
C  -1.994082 -1.013781 -0.151363
H  -2.682246 -1.600507 0.457995
C  -0.541627 -1.087219 0.276721
C  0.589724 -1.075691 -0.519488
C  1.902512 -0.63288 0.045486
H  2.000067 -0.965019 1.0846
H  2.737535 -1.042175 -0.529033
C  1.928394 0.934146 -0.006728
H  2.10503 1.258945 -1.038448
H  2.757308 1.310441 0.598509
C  0.57076 1.474224 0.481802
C  -0.506538 0.720359 -0.248849
H  0.50483 -1.275442 -1.586955
H  -2.133989 -1.258303 -1.208027
H  0.455273 1.384997 1.567287
H  -0.396804 0.805291 -1.333449
H  -2.667539 1.113091 -0.523966
H  0.477033 2.539621 0.228746
H  -0.380735 -1.04138 1.354522
totalener: -312.09068545 hartree
nucrepener: 387.31926229 hartree
electener: -699.40994774 hartree
oneelecener: -1175.45293417 hartree
twoeener: 476.04298643 hartree
kineticenergy: 310.19156571 hartree
exchangeener: -34.199079333321 hartree
correlationener: -1.978845987455 hartree
xcener: -36.177925320775 hartree
chargesum: 1.0000000
charge: -0.185771 0.162503 -0.188710 0.176844 -0.041830 -0.042172 -0.222753 0.162563 0.178167 -0.240829 0.156173 0.174296 -0.192666 -0.100744 0.203368 0.157049 0.146650 0.170996 0.174455 0.178075 0.174337
charge: -0.188875 0.158364 -0.185516 0.154974 -0.066086 -0.011912 -0.207691 0.162312 0.164680 -0.214331 0.152982 0.156982 -0.229065 -0.022798 0.170863 0.157589 0.156057 0.179875 0.154773 0.176134 0.180690
qa: -0.1858 0.1625 -0.1887 0.1768 -0.0418 -0.0422 -0.2228 0.1626 0.1782 -0.2408 0.1562 0.1743 -0.1927 -0.1007 0.2034 0.1570 0.1466 0.1710 0.1745 0.1781 0.1743
va: 3.9279 0.9756 3.9352 0.9706 3.9214 3.8512 3.9635 0.9664 0.9675 3.9553 0.9699 0.9663 3.9674 3.9182 0.9446 0.9741 0.9741 0.9621 0.9692 0.9659 0.9619
dispcorr: -0.017957951 hartree
energy: -312.108643397020
dipole: 0.55209 -0.66690 -0.11481 1.84470 -1.91188 -0.06718 0.21434 -0.38227 -0.16793
magnitude: 0.21423 au
magnitude: 0.54454 debye
