program: Orca
programVersion: 5.0.3
elementType: C H C H C C C H H C H H C C H H H H H H H
charge: 1
multiplicity: 1
keywords: b3lyp cc-pVTZ EnGrad D3BJ RIJCOSX verytightscf cc-pVTZ/C def2/J soscf
formula: C8H13
InChI: InChI=1/C8H13/c1-2-4-6-8-7-5-3-1/h1-2,7H,3-6,8H2
21 atoms
C  -1.995714 0.619816 0.080386
H  -2.173744 0.780445 1.150216
C  -1.801465 -0.951913 -0.171671
H  -2.642146 -1.457501 0.312543
C  -0.426537 -1.331167 0.363286
C  0.660328 -1.252599 -0.425011
C  1.959662 -0.703751 0.071182
H  2.139363 -0.941282 1.12474
H  2.826128 -1.034121 -0.511847
C  1.813858 0.841405 -0.110703
H  1.851199 1.099435 -1.175085
H  2.637603 1.368775 0.378356
C  0.464902 1.391504 0.506316
C  -0.711896 1.212663 -0.327357
H  0.521869 -1.236619 -1.509058
H  -1.859489 -1.145148 -1.247345
H  0.307196 1.028169 1.524064
H  -0.622986 1.555583 -1.363258
H  -2.838189 0.988864 -0.511719
H  0.61199 2.492117 0.546751
H  -0.314118 -1.387797 1.446669
totalener: -312.22299555 hartree
nucrepener: 379.76855867 hartree
electener: -691.99155422 hartree
oneelecener: -1160.57612396 hartree
twoeener: 468.58456974 hartree
kineticenergy: 309.97040911 hartree
exchangeener: -36.299030316285 hartree
correlationener: -2.303739064730 hartree
xcener: -38.602769381016 hartree
chargesum: 1.0000000
charge: -0.167978 0.155304 -0.176860 0.153975 -0.113704 -0.117285 -0.170597 0.132707 0.150313 -0.187854 0.131753 0.153266 -0.163666 0.079141 0.149285 0.143221 0.141639 0.207866 0.162903 0.183569 0.153004
charge: 0.103666 0.010925 0.108878 -0.001215 0.076307 0.057993 0.076248 -0.003267 0.004037 0.118894 -0.009465 -0.001608 0.080892 0.343201 -0.018141 -0.001921 0.004019 0.016869 0.008214 0.045703 -0.020230
qa: -0.1680 0.1553 -0.1769 0.1540 -0.1137 -0.1173 -0.1706 0.1327 0.1503 -0.1879 0.1318 0.1533 -0.1637 0.0791 0.1493 0.1432 0.1416 0.2079 0.1629 0.1836 0.1530
va: 3.8104 0.9860 3.8568 0.9801 3.7938 3.8062 3.8603 0.9926 0.9832 3.8283 0.9895 0.9799 3.8568 3.5116 0.9904 0.9887 0.9965 0.9681 0.9829 0.9740 0.9937
dispcorr: -0.036511143 hartree
energy: -312.259506694378
dipole: 0.41657 -0.91946 -0.50288 1.97624 -0.79984 1.17640 0.15445 -0.27640 -0.12195
magnitude: 1.28517 au
magnitude: 3.26665 debye
