program: Orca
programVersion: 5.0.3
elementType: C H C H C C C H H C H H C C H H H H H H H
charge: 1
multiplicity: 1
keywords: DSD-PBEP86/2013 def2-TZVP D3BJ RIJCOSX verytightscf def2-TZVP/C def2/J soscf noTRAH
formula: C8H13
InChI: InChI=1/C8H13/c1-2-4-6-8-7-5-3-1/h1-2,7H,3-6,8H2
21 atoms
C  -1.997358 0.748845 0.074373
H  -2.179187 0.853911 1.147174
C  -1.740002 -0.948079 -0.150024
H  -2.618464 -1.325742 0.378413
C  -0.424029 -1.376292 0.399808
C  0.691601 -1.282706 -0.36915
C  2.005276 -0.687879 0.06563
H  2.216939 -0.878799 1.123463
H  2.857968 -1.028875 -0.52666
C  1.795328 0.880626 -0.144948
H  1.84921 1.128873 -1.210273
H  2.603303 1.419832 0.355117
C  0.422018 1.252866 0.466634
C  -0.761884 1.314125 -0.379276
H  0.527988 -1.212844 -1.449184
H  -1.841348 -1.122382 -1.222042
H  0.143413 0.388326 1.084093
H  -0.643736 1.472236 -1.454969
H  -2.87569 0.984298 -0.52623
H  0.413227 2.015991 1.266559
H  -0.344156 -1.505767 1.480115
totalener: -311.10644015 hartree
nucrepener: 380.22252845 hartree
electener: -691.32896860 hartree
oneelecener: -1160.80997767 hartree
twoeener: 469.48100907 hartree
kineticenergy: 310.01074168 hartree
exchangeener: -14.120314481915 hartree
correlationener: -0.944285063906 hartree
xcener: -15.064599545821 hartree
chargesum: 1.0000000
charge: -0.252840 0.193835 -0.222948 0.193216 -0.183631 -0.120807 -0.209233 0.156783 0.166190 -0.292592 0.156879 0.170353 -0.113161 0.093276 0.142098 0.183775 0.127715 0.207118 0.195352 0.228902 0.179721
charge: -0.169461 0.165327 -0.130738 0.159512 -0.198733 -0.115886 -0.211034 0.148046 0.147400 -0.200581 0.141689 0.150454 -0.215865 0.150579 0.150804 0.152855 0.202387 0.172733 0.159330 0.191235 0.149947
qa: -0.2528 0.1938 -0.2229 0.1932 -0.1836 -0.1208 -0.2092 0.1568 0.1662 -0.2926 0.1569 0.1704 -0.1132 0.0933 0.1421 0.1838 0.1277 0.2071 0.1954 0.2289 0.1797
va: 3.8518 0.9620 3.8733 0.9566 3.8015 3.8842 3.8552 0.9714 0.9739 3.9187 0.9675 0.9706 3.6833 3.5882 0.9675 0.9605 1.0361 0.9470 0.9641 0.9405 0.9604
total: -311.764065552 hartree
dispcorr: -0.014325981 hartree
energy: -311.778391533220
dipole: 0.10252 -0.96330 -0.86079 1.11381 0.01424 1.12805 0.41744 -0.55012 -0.13269
magnitude: 1.42515 au
magnitude: 3.62245 debye
