program: Gaussian 09
title: 000051067
version: EM64L-G09RevD.01
frameworkgroup: C1[X(C13H22N2)]
method: RPBEPBE
basis: SDD
operation: Freq
keyword: #pfreq=noraman
keyword: PBEPBE/SDD
title: #p freq=noraman PBEPBE/SDD
converged: YES YES NO NO
title: Mulliken charges:
elementType: N N C C C C C C C C C C C C C H H H H H H H H H H H H H H H H H H H H H H
charge: -0.257283 -0.271846 0.438552 -0.387003 -0.533698 -0.411324 0.229387 -0.423494 0.189343 -0.580483 -0.548330 -0.362803 -0.824137 -0.320421 -0.688434 0.217368 0.221550 0.226047 0.208541 0.207883 0.209810 0.206148 0.217782 0.253276 0.241733 0.199081 0.227514 0.179644 0.226146 0.223450 0.217233 0.236842 0.175830 0.211626 0.232721 0.200592 0.211158
chargesum: 0.00000
title: Mulliken charges with hydrogens summed into heavy atoms:
elementType: N N C C C C C C C C C C C C C
charge: -0.257283 -0.035004 0.438552 0.051915 -0.099110 0.006369 0.229387 0.000437 0.189343 -0.327207 -0.107515 0.044354 -0.157308 0.067035 -0.043964
polarizability: 1.86574965e+02 1.87901953e+00 1.61866640e+02 8.86976187e+00 -4.50622518e+00 1.11628726e+02
1716.lowfreq: -5.4862 -0.0004 -0.0003 0.0003 1.3897 9.4520 31.4870 51.0695 56.3406
frequency: 31.2099 50.9521 56.2572 61.5858 89.5888 96.7426 124.6588 138.5394 169.5542 196.0898 230.1512 256.9981 276.9371 286.6040 309.8838 331.3422 365.2314 419.6671 451.5653 455.0782 515.6892 578.1001 619.2741 638.5409 651.0130 688.1808 728.0019 777.2340 794.2458 810.4156 817.6165 830.9536 871.6757 908.5495 923.5893 946.4019 971.3419 979.5129 1016.9203 1038.2734 1040.0725 1047.8817 1087.7011 1094.1636 1105.7065 1114.3670 1140.9469 1148.5954 1152.7819 1167.2897 1171.1098 1205.8993 1210.4986 1250.2467 1256.6142 1263.8054 1276.7296 1285.3485 1314.6912 1330.5514 1336.3038 1344.0815 1349.8629 1361.7454 1378.2292 1391.4483 1400.0234 1419.8791 1431.1206 1445.3080 1462.4507 1466.2752 1469.8581 1471.0610 1472.8382 1473.3431 1479.8856 1481.1159 1486.5174 1495.3241 1500.2173 1526.3685 1592.6822 2838.0958 2850.6970 2947.2690 2949.7245 2954.1920 2963.5837 2978.0191 2982.8669 2987.5105 2998.2900 3012.8101 3029.7798 3031.6621 3035.8421 3047.4425 3051.7787 3056.6719 3066.2876 3070.2025 3092.4321 3194.7629 3414.5680
redmass: 3.4952 1.8442 1.4775 1.5479 2.8149 2.9352 2.9364 2.1408 3.0974 2.4770 3.2337 1.1299 2.8727 2.6391 1.9588 3.0607 3.1636 3.9623 2.6533 2.9440 2.6994 3.7815 2.8488 3.6248 1.6654 2.7178 2.5148 1.5690 1.3220 1.2023 2.0036 1.4665 2.2679 1.7633 1.4247 2.3643 2.1441 1.4606 3.3481 1.8326 1.7666 2.3665 1.6315 1.5974 1.8354 2.1785 2.0683 1.4118 2.7554 1.3094 1.7924 3.3182 1.5326 1.2637 1.2062 1.2143 1.1589 1.3172 1.5327 1.3437 1.4535 1.5968 1.5415 2.9969 1.3665 1.2764 1.2782 2.8494 3.6939 1.2346 1.1004 1.0823 1.0946 1.0738 1.0898 1.0611 1.1132 1.0828 1.0978 1.1410 1.0894 6.6529 6.3718 1.0718 1.0719 1.0687 1.0667 1.0680 1.0378 1.0375 1.0628 1.0617 1.0859 1.0851 1.0918 1.0940 1.0969 1.0990 1.0931 1.1043 1.0976 1.0979 1.1002 1.0975 1.0738
irintensity: 0.0107 0.1272 0.3177 0.5758 0.7908 2.0628 0.2909 1.4993 2.4467 5.1938 1.1026 0.8184 1.7682 3.1064 0.8289 0.1425 4.1175 1.0168 1.3340 5.3381 4.3413 1.3082 6.9236 4.9365 66.3573 19.2669 6.0093 1.4125 28.0329 2.6688 5.1123 6.4992 2.7073 1.6732 0.9964 3.2581 2.0038 2.1274 1.8492 8.9683 1.9621 9.4917 1.0942 3.5992 10.4865 7.4394 5.2407 0.7010 75.4022 1.4887 8.9712 6.8120 5.4497 14.9990 4.0740 7.0435 1.2709 4.4720 6.2812 6.0756 22.8248 5.8104 2.5561 36.3728 2.3235 20.5444 12.7164 13.5257 14.8014 39.9381 4.1440 3.2582 17.9354 9.2983 1.2782 19.2351 12.9033 8.0792 1.8681 2.0426 4.8044 9.1924 3.1005 66.0475 177.9340 61.2336 7.6976 81.7460 60.1201 35.7773 36.5858 24.4659 26.9874 28.9324 69.0295 3.8089 29.2613 64.1809 28.7474 60.6309 30.2120 58.3051 37.7433 7.7455 3.1090
temp: 298.150 k
press: 1.00000 atm
elementType: 7 7 6 6 6 6 6 6 6 6 6 6 6 6 6 1 1 1 1 1 1 1 1 1 1 1 1 1 1 1 1 1 1 1 1 1 1
symmnumber: 1
zpe: 861069.6 jmol-1
zpe.correction: 0.327964 hartree
zpe.thermalcorrener: 0.344280 hartree
zpe.thermalcorrenthalpy: 0.345224 hartree
zpe.thermalcorrgfe: 0.283052 hartree
zpe.sumelectzpe: -616.897651 hartree
zpe.sumelectthermal: -616.881335 hartree
zpe.sumelectthermalent: -616.880390 hartree
zpe.sumelectthermalfe: -616.942563 hartree
dipole: -0.2017 -3.0086 -0.0085
dipole: 3.0154
quadrupole: -89.7307 -88.9821 -93.5992
quadrupole: 0.5717 -0.5007 -2.3964
quadrupole: 1.0399 1.7885 -2.8285 0.5717 -0.5007 -2.3964
hfenergy: -617.2256147 hartree
pointgroup: C01 [X(C13H22N2)]
dipole: 0.0944869 1.1825337 -0.0101047 debye
polarizability: 186.5740761|1.5240532|161.8718684|-9.0090382|4.339113|111.6243867 unknown
InChI: InChI=1S/C13H22N2/c1-3-14-8-7-13-11(2)10-12-6-4-5-9-15(12)13/h10,14H,3-9H2,1-2H3
charge 0 multiplicity 1
37 atoms
N  1.19897 0.216408 0.157911
N  -3.478689 0.325684 0.257716
C  2.383644 -0.394125 -0.283429
C  1.085747 1.639223 0.529853
C  3.608489 0.423235 -0.619943
C  2.201377 2.472145 -0.134657
C  0.209868 -0.7682 0.37024
C  3.581215 1.807913 0.075357
C  0.772755 -2.013538 0.03503
C  2.13579 -1.768741 -0.371085
C  -1.178103 -0.427696 0.845659
C  -2.133833 0.041398 -0.283307
C  0.081686 -3.35542 0.073581
C  -4.482228 0.742648 -0.745615
C  -5.841719 1.022532 -0.081896
H  1.157968 1.741397 1.633474
H  0.091642 2.01571 0.226102
H  4.518587 -0.137261 -0.336575
H  3.670549 0.583502 -1.717705
H  2.183723 3.491332 0.294603
H  2.001833 2.565418 -1.220424
H  3.770756 1.691376 1.161272
H  4.384151 2.450609 -0.330763
H  2.855245 -2.519866 -0.697985
H  -1.632606 -1.315795 1.319605
H  -1.144806 0.35559 1.63324
H  -2.222918 -0.767224 -1.03411
H  -1.680156 0.917017 -0.817001
H  -0.112851 -3.748278 -0.94382
H  0.697683 -4.110072 0.5983
H  -0.891741 -3.300999 0.593607
H  -3.435596 0.993238 1.042296
H  -4.160101 1.643356 -1.329426
H  -4.590592 -0.081465 -1.478356
H  -6.194603 0.127441 0.459509
H  -5.768308 1.855555 0.644043
H  -6.598528 1.301655 -0.8371
