program: Orca
programVersion: 5.0.3
elementType: C H C H C C C H H C H H C C H H H H H H H
charge: 1
multiplicity: 1
keywords: DSD-PBEP86 cc-pVTZ EnGrad RIJCOSX verytightscf cc-pVTZ/C def2/J soscf
formula: C8H13
InChI: InChI=1/C8H12.H/c1-2-4-6-8-7-5-3-1;/h1-2,7-8H,3-6H2;
21 atoms
C  -1.985418 0.660494 0.113949
H  -2.159244 0.852025 1.177384
C  -1.8397 -0.941439 -0.125734
H  -2.64914 -1.439582 0.410891
C  -0.46316 -1.340434 0.383749
C  0.679887 -1.265444 -0.375672
C  1.986718 -0.66094 0.102236
H  2.164582 -0.862094 1.163233
H  2.846838 -1.011246 -0.471228
C  1.840468 0.94194 -0.123453
H  1.943036 1.164995 -1.190161
H  2.649778 1.437408 0.41587
C  0.463663 1.333374 0.392653
C  -0.682346 1.27189 -0.363834
H  0.546214 -1.261884 -1.460949
H  -1.945092 -1.154707 -1.194156
H  0.001024 0.001092 0.050391
H  -0.553791 1.283938 -1.449608
H  -2.848697 1.01377 -0.45288
H  0.349386 1.325915 1.479889
H  -0.34659 -1.349007 1.470502
totalener: -311.10138968 hartree
nucrepener: 382.90014986 hartree
electener: -694.00153954 hartree
oneelecener: -1165.65752912 hartree
twoeener: 471.65598958 hartree
kineticenergy: 309.66312272 hartree
exchangeener: -12.749354268342 hartree
correlationener: -0.949512468681 hartree
xcener: -13.698866737024 hartree
chargesum: 1.0000000
charge: -0.260537 0.175188 -0.262731 0.189134 -0.064466 -0.056197 -0.260293 0.175004 0.188177 -0.262457 0.172878 0.189079 -0.064201 -0.055847 0.187321 0.172994 0.078759 0.187948 0.188232 0.190755 0.191258
charge: 0.108653 -0.002899 0.110641 0.002130 0.135378 0.144010 0.108635 -0.002957 0.002472 0.110748 -0.003306 0.002087 0.135205 0.145234 0.003666 -0.003283 -0.010861 0.003604 0.002537 0.004422 0.003884
qa: -0.2605 0.1752 -0.2627 0.1891 -0.0645 -0.0562 -0.2603 0.1750 0.1882 -0.2625 0.1729 0.1891 -0.0642 -0.0558 0.1873 0.1730 0.0788 0.1879 0.1882 0.1908 0.1913
va: 3.9014 0.9802 3.9055 0.9727 3.8019 3.8055 3.9014 0.9804 0.9731 3.9054 0.9816 0.9727 3.8022 3.8046 0.9818 0.9815 1.1541 0.9815 0.9731 0.9813 0.9810
energy: -311.817293052416
dipole: -0.00155 -0.00136 -0.00291 0.00126 0.00186 0.00312 -0.04718 0.03985 -0.00733
magnitude: 0.00848 au
magnitude: 0.02157 debye
