program: Orca
programVersion: 5.0.3
elementType: C H C H C C C H H C H H C C H H H H H H H
charge: 1
multiplicity: 1
keywords: PBE0 cc-pVTZ EnGrad RIJCOSX verytightscf cc-pVTZ/C def2/J soscf
formula: C8H13
InChI: InChI=1/C8H13/c1-2-4-6-8-7-5-3-1/h1-2,7H,3-6,8H2
21 atoms
C  -2.002607 0.722585 0.080804
H  -2.206275 0.874309 1.144616
C  -1.76289 -0.928799 -0.143872
H  -2.619196 -1.366557 0.373914
C  -0.429752 -1.356097 0.409155
C  0.697827 -1.284529 -0.364014
C  2.00908 -0.687027 0.070879
H  2.222681 -0.879509 1.127658
H  2.859253 -1.021267 -0.527607
C  1.802009 0.898191 -0.143812
H  1.861146 1.132721 -1.211785
H  2.616406 1.42517 0.357158
C  0.425227 1.273029 0.436698
C  -0.741591 1.319262 -0.369844
H  0.530673 -1.208028 -1.443027
H  -1.851279 -1.127632 -1.214413
H  0.070723 0.187981 0.722475
H  -0.600479 1.336402 -1.454927
H  -2.868523 0.993095 -0.52449
H  0.364598 1.68801 1.450572
H  -0.347537 -1.517215 1.486248
totalener: -312.00927709 hartree
nucrepener: 381.40577174 hartree
electener: -693.41504883 hartree
oneelecener: -1163.55764092 hartree
twoeener: 470.14259209 hartree
kineticenergy: 309.59941667 hartree
exchangeener: -34.139690823877 hartree
correlationener: -1.970051344829 hartree
xcener: -36.109742168706 hartree
chargesum: 1.0000000
charge: -0.192323 0.158798 -0.210342 0.166032 -0.110481 -0.058890 -0.184053 0.141319 0.153795 -0.205312 0.144046 0.155553 -0.134762 0.061295 0.150202 0.157008 0.114945 0.174373 0.170301 0.183383 0.165113
charge: 0.113948 0.004419 0.130376 0.006392 0.051914 0.121987 0.088763 -0.002406 -0.000486 0.114390 -0.007183 -0.000036 0.098150 0.246820 -0.007899 -0.003156 0.005712 0.008946 0.006625 0.028760 -0.006035
qa: -0.1923 0.1588 -0.2103 0.1660 -0.1105 -0.0589 -0.1841 0.1413 0.1538 -0.2053 0.1440 0.1556 -0.1348 0.0613 0.1502 0.1570 0.1149 0.1744 0.1703 0.1834 0.1651
va: 3.8607 0.9879 3.9125 0.9829 3.8087 3.8158 3.8749 0.9932 0.9852 3.8988 0.9928 0.9885 3.8148 3.6841 0.9913 0.9878 1.0925 0.9851 0.9828 0.9907 0.9938
energy: -312.009277091018
dipole: 0.03019 -0.44449 -0.41429 0.48543 0.04654 0.53197 0.26865 -0.29740 -0.02875
magnitude: 0.67488 au
magnitude: 1.71540 debye
