program: Orca
programVersion: 5.0.3
elementType: C H C H C C C H H C H H C C H H H H H H H
charge: 1
multiplicity: 1
keywords: PBE0 cc-pVTZ EnGrad RIJCOSX verytightscf cc-pVTZ/C def2/J soscf
formula: C8H13
InChI: InChI=1/C8H13/c1-2-4-6-8-7-5-3-1/h1-2,7H,3-6,8H2
21 atoms
C  -1.997624 0.746683 0.074937
H  -2.18192 0.856054 1.146941
C  -1.741858 -0.946087 -0.149455
H  -2.618306 -1.328957 0.37819
C  -0.42471 -1.374358 0.400847
C  0.692509 -1.283088 -0.368699
C  2.005606 -0.687857 0.066018
H  2.217468 -0.87862 1.123825
H  2.858053 -1.028222 -0.526833
C  1.795756 0.882563 -0.145018
H  1.85087 1.129448 -1.210491
H  2.604701 1.420235 0.355206
C  0.422398 1.255116 0.462616
C  -0.760227 1.314953 -0.378846
H  0.528503 -1.213132 -1.448604
H  -1.842166 -1.122644 -1.221281
H  0.133728 0.354589 1.067346
H  -0.64076 1.459232 -1.456395
H  -2.875043 0.984432 -0.526222
H  0.408213 1.985364 1.288817
H  -0.344808 -1.508702 1.480688
totalener: -312.01741525 hartree
nucrepener: 380.25805525 hartree
electener: -692.27547050 hartree
oneelecener: -1161.44825793 hartree
twoeener: 469.17278743 hartree
kineticenergy: 309.61481124 hartree
exchangeener: -34.140839629599 hartree
correlationener: -1.964316880157 hartree
xcener: -36.105156509756 hartree
chargesum: 1.0000000
charge: -0.199280 0.169290 -0.192616 0.172592 -0.139588 -0.082891 -0.177566 0.134927 0.148921 -0.201388 0.139608 0.152773 -0.196520 0.107618 0.142996 0.164565 0.138092 0.188203 0.176853 0.195371 0.158040
charge: 0.124569 0.011143 0.154745 0.009483 0.023614 0.089773 0.080436 -0.003478 -0.002666 0.107938 -0.010596 -0.000479 0.079879 0.287676 -0.013697 -0.000748 0.019008 0.012356 0.007905 0.039098 -0.015959
qa: -0.1993 0.1693 -0.1926 0.1726 -0.1396 -0.0829 -0.1776 0.1349 0.1489 -0.2014 0.1396 0.1528 -0.1965 0.1076 0.1430 0.1646 0.1381 0.1882 0.1769 0.1954 0.1580
va: 3.8657 0.9838 3.8985 0.9790 3.8210 3.8228 3.8845 0.9948 0.9869 3.8782 0.9933 0.9876 3.8529 3.5992 0.9932 0.9843 1.0392 0.9806 0.9818 0.9807 0.9960
energy: -312.017415248876
dipole: 0.09228 -0.82959 -0.73731 1.03917 -0.15337 0.88580 0.42294 -0.47799 -0.05505
magnitude: 1.15382 au
magnitude: 2.93277 debye
