program: Gaussian 09
title: 000051030
version: EM64L-G09RevD.01
frameworkgroup: C1[X(C15H19N3OS)]
method: RPBEPBE
basis: SDD
operation: Freq
keyword: #p
keyword: freq=noraman
keyword: PBEPBE/SDD
title: #p freq=noraman PBEPBE/SDD
converged: YES YES NO NO
title: Mulliken charges:
elementType: S O N N N C C C C C C C C C C C C C C C H H H H H H H H H H H H H H H H H H H
charge: 0.161092 -0.248178 -0.045341 -0.393726 -0.484685 -0.399125 -0.397129 -0.390456 -0.360876 -0.361385 -0.479271 0.218824 -0.155898 -0.009988 0.592249 -0.344880 -0.391478 -0.291716 -0.198453 -0.259075 0.215024 0.186470 0.191033 0.215873 0.210882 0.190620 0.164332 0.236825 0.212093 0.162958 0.239626 0.169158 0.307109 0.280888 0.319286 0.236163 0.242134 0.228266 0.230757
chargesum: 0.00000
title: Mulliken charges with hydrogens summed into heavy atoms:
elementType: S O N N N C C C C C C C C C C C C C C C
charge: 0.161092 -0.248178 -0.045341 -0.086617 -0.165399 0.002369 0.009776 0.011046 0.040281 0.013666 -0.070487 0.218824 0.124990 -0.009988 0.592249 -0.344880 -0.155315 -0.049583 0.029813 -0.028319
polarizability: 3.89893595e+02 2.73586458e+01 1.81732120e+02 -2.37797655e+01 1.18841844e+01 1.25735530e+02
1716.lowfreq: -13.1186 -1.3653 -0.0015 -0.0014 0.0011 1.9326 9.0269 24.9388 34.8047
frequency: -5.9014 24.8808 34.7979 39.5441 66.2888 77.7363 121.2096 156.5549 175.3951 191.5006 215.1991 237.3626 246.3666 284.5504 296.5253 318.8615 351.1409 373.4892 407.9190 418.6836 447.9518 449.4214 466.5967 469.5014 474.2807 535.3886 544.9538 547.2322 584.7127 587.6570 627.8652 644.0003 676.1883 717.9972 734.1037 744.6695 773.4009 797.3415 807.7733 838.9815 853.0577 855.2931 859.6238 902.0451 919.5548 938.9290 959.8630 966.0414 974.1566 1002.5499 1017.1956 1035.1751 1048.0188 1081.4459 1107.5858 1122.0202 1124.3370 1140.7668 1153.1150 1167.8905 1170.4621 1188.3421 1194.0177 1214.0286 1241.8408 1258.7939 1266.0443 1274.5295 1281.7323 1285.2138 1296.5943 1330.5466 1338.2227 1340.7775 1349.5763 1365.8779 1368.6046 1394.1332 1416.4412 1442.0378 1450.5059 1452.5965 1461.0075 1464.8487 1467.5237 1468.9229 1477.3629 1479.2876 1596.8397 1601.7242 1617.8279 1706.0467 2770.3721 2802.5098 2818.7266 2964.5431 2987.7866 2990.4985 3004.5649 3018.0400 3032.1362 3037.1225 3050.0404 3058.5242 3133.8263 3145.8645 3155.8828 3159.2805 3173.5827 3524.3910 3589.2091
redmass: 4.4452 6.0910 3.4552 6.6612 4.6394 5.1547 4.7465 3.5916 5.3607 4.7379 4.8932 2.0293 3.9575 2.2855 2.5399 4.5542 3.6971 1.7323 4.0672 2.8210 2.2487 1.7784 3.0722 4.9035 9.0055 5.1052 3.8781 2.5496 1.3760 2.8102 5.0162 5.5317 6.8647 2.9828 4.5402 1.3993 4.2982 1.3465 1.4725 1.3933 3.0004 1.4397 4.3257 2.6322 1.3778 3.8017 1.2931 1.3113 1.9975 2.4979 3.4468 2.8557 2.0685 1.4015 2.3038 1.5545 2.5116 2.8324 1.3274 2.4042 1.0748 1.5082 4.7428 1.7284 1.3972 1.3043 1.2030 1.5862 1.7132 1.5131 1.4604 1.2745 1.4053 1.4420 1.4826 1.6609 2.0635 1.4756 2.9953 1.1523 1.9826 1.0910 1.0868 1.1014 1.0962 3.0444 1.2599 1.8373 6.0828 7.3954 6.1160 8.3241 1.0712 1.0714 1.0697 1.0632 1.0620 1.0611 1.0838 1.0863 1.0912 1.0916 1.1035 1.1034 1.0860 1.0893 1.0950 1.0904 1.1003 1.0772 1.0783
irintensity: 0.0824 3.1575 1.4561 2.1863 2.3693 8.7665 0.7508 0.1871 0.0041 0.5654 4.4447 0.6363 6.0451 8.9454 8.9910 0.7596 9.9154 3.6958 5.2832 19.6302 19.1901 33.9332 4.3492 2.8769 2.3823 3.1359 0.4472 5.5624 84.4361 14.5364 23.9097 2.0687 2.8869 9.3374 5.0102 114.3024 14.0116 61.3548 0.4684 2.5380 4.4993 3.1330 12.0407 5.4628 3.5049 19.6305 2.5793 0.0869 7.8140 18.5783 34.5349 2.6283 5.1396 11.8790 57.2847 11.4601 6.3423 5.9289 9.7890 23.2144 1.4803 38.0071 24.2968 58.1073 84.0769 4.8530 3.7939 8.2704 54.9344 57.6508 9.6838 13.0902 25.6501 5.3744 0.4340 1.6210 41.6176 8.7242 12.2225 62.9979 222.9510 8.4145 14.4399 3.0686 17.6551 36.7669 126.2947 560.2070 95.5405 123.3842 207.2832 133.2314 111.1413 53.6578 194.9748 41.2310 34.1546 33.2319 12.9890 70.2692 84.0702 24.9514 20.1194 81.8623 5.3913 4.3965 19.3850 57.7845 21.7759 7.6879 38.0486
temp: 298.150 k
press: 1.00000 atm
elementType: 16 8 7 7 7 6 6 6 6 6 6 6 6 6 6 6 6 6 6 6 1 1 1 1 1 1 1 1 1 1 1 1 1 1 1 1 1 1 1
symmnumber: 1
zpe: 833892.3 jmol-1
zpe.correction: 0.317613 hartree
zpe.thermalcorrener: 0.335478 hartree
zpe.thermalcorrenthalpy: 0.336422 hartree
zpe.thermalcorrgfe: 0.270403 hartree
zpe.sumelectzpe: -1219.041164 hartree
zpe.sumelectthermal: -1219.023299 hartree
zpe.sumelectthermalent: -1219.022355 hartree
zpe.sumelectthermalfe: -1219.088374 hartree
dipole: -2.4331 -2.2764 0.1361
dipole: 3.3348
quadrupole: -109.6039 -124.5630 -128.2069
quadrupole: -15.3366 -4.1321 5.3132
quadrupole: 11.1874 -3.7717 -7.4156 -15.3366 -4.1321 5.3132
hfenergy: -1219.358777 hartree
pointgroup: C01[X(C15H19N3O1S1)]
dipole: 0.9549782 0.8267381 0.3548066 debye
polarizability: 389.4618461|17.8190954|182.9896523|33.3024872|8.4284214|124.9097467 unknown
InChI: InChI=1S/C15H19N3OS/c19-14(11-18-8-4-1-5-9-18)16-10-15-17-12-6-2-3-7-13(12)20-15/h2-3,6-7,10,16-17H,1,4-5,8-9,11H2
charge 0 multiplicity 1
39 atoms
S  2.291035 1.330773 -0.029277
O  -2.0145 -1.837486 -1.107389
N  -4.155813 0.149056 -0.423303
N  -0.5603 -0.06898 -0.689354
N  3.003293 -1.23044 -0.190151
C  -6.466481 0.478355 1.357649
C  -5.254973 -0.399723 1.744511
C  -6.604979 0.538359 -0.180583
C  -3.972864 0.096502 1.046867
C  -5.288782 1.014965 -0.827655
C  -2.919278 0.476485 -1.144242
C  -1.82586 -0.593474 -0.970895
C  0.580589 -0.894001 -0.579686
C  1.8372 -0.440759 -0.30672
C  4.202318 -0.56616 0.090431
C  4.043715 0.84253 0.218003
C  5.481276 -1.146309 0.247688
C  5.128142 1.683745 0.497064
C  6.579513 -0.29991 0.529983
C  6.413077 1.098911 0.654395
H  -7.393603 0.084212 1.814935
H  -6.320397 1.504984 1.754606
H  -5.100901 -0.394287 2.840742
H  -5.440695 -1.44568 1.434893
H  -6.845066 -0.469651 -0.5696
H  -7.426474 1.219572 -0.475155
H  -3.698249 1.108173 1.454328
H  -3.136048 -0.590579 1.268629
H  -5.374302 0.982726 -1.930616
H  -5.108491 2.086474 -0.537816
H  -3.156445 0.532807 -2.22518
H  -2.503241 1.482292 -0.852049
H  -0.470549 0.941855 -0.560705
H  0.365372 -1.955441 -0.734064
H  2.952244 -2.240915 -0.309577
H  5.618897 -2.228666 0.152606
H  4.994325 2.765754 0.592433
H  7.574526 -0.740833 0.653222
H  7.273871 1.738566 0.872635
