program: Orca
programVersion: 5.0.3
elementType: C H C H C C C H H C H H C C H H H H H H H
charge: 1
multiplicity: 1
keywords: b3lyp def2-TZVP EnGrad D3BJ RIJCOSX verytightscf def2/J soscf
formula: C8H13
InChI: InChI=1/C8H13/c1-2-4-6-8-7-5-3-1/h1-2,7H,3-6,8H2
21 atoms
C  -1.998994 0.648378 0.076698
H  -2.176419 0.788326 1.149065
C  -1.781447 -0.953424 -0.171834
H  -2.636245 -1.430544 0.316524
C  -0.417797 -1.348188 0.370231
C  0.666143 -1.260135 -0.415347
C  1.969653 -0.706699 0.069632
H  2.156807 -0.938495 1.123204
H  2.83484 -1.034847 -0.516211
C  1.806884 0.83565 -0.116247
H  1.842001 1.094685 -1.180364
H  2.623495 1.372752 0.373924
C  0.452701 1.370797 0.502997
C  -0.729946 1.238968 -0.331109
H  0.518612 -1.215833 -1.498083
H  -1.845447 -1.142218 -1.247287
H  0.286968 0.98212 1.509764
H  -0.640085 1.596152 -1.362083
H  -2.850787 0.988791 -0.517285
H  0.595735 2.471539 0.577232
H  -0.313246 -1.414257 1.453467
totalener: -312.22342808 hartree
nucrepener: 379.45671586 hartree
electener: -691.68014393 hartree
oneelecener: -1159.99532031 hartree
twoeener: 468.31517637 hartree
kineticenergy: 310.51842985 hartree
exchangeener: -36.319592448952 hartree
correlationener: -2.303359313887 hartree
xcener: -38.622951762839 hartree
chargesum: 1.0000000
charge: -0.195387 0.172712 -0.205616 0.169128 -0.151063 -0.089171 -0.202255 0.146000 0.156834 -0.239210 0.147997 0.162162 -0.114831 0.072111 0.132570 0.164100 0.150473 0.205025 0.173682 0.192494 0.152244
charge: -0.181130 0.170238 -0.168006 0.154889 -0.136919 -0.139774 -0.218438 0.152012 0.157130 -0.191242 0.147466 0.153694 -0.203113 0.139207 0.153551 0.154288 0.162040 0.174008 0.162947 0.206662 0.150490
qa: -0.1954 0.1727 -0.2056 0.1691 -0.1511 -0.0892 -0.2023 0.1460 0.1568 -0.2392 0.1480 0.1622 -0.1148 0.0721 0.1326 0.1641 0.1505 0.2050 0.1737 0.1925 0.1522
va: 3.8418 0.9636 3.8258 0.9650 3.8374 3.7994 3.8758 0.9706 0.9707 3.8757 0.9663 0.9639 3.7993 3.5597 0.9693 0.9668 0.9832 0.9434 0.9678 0.9549 0.9675
dispcorr: -0.036487899 hartree
energy: -312.259915977598
dipole: 0.37113 -0.96817 -0.59704 1.98305 -0.70264 1.28040 0.17024 -0.29483 -0.12459
magnitude: 1.41824 au
magnitude: 3.60488 debye
