program: Orca
programVersion: 5.0.3
elementType: C H C H C C C H H C H H C C H H H H H H H
charge: 1
multiplicity: 1
keywords: DSD-PBEP86/2013 def2-TZVP RIJCOSX verytightscf def2-TZVP/C def2/J soscf noTRAH
formula: C8H13
InChI: InChI=1/C8H13/c1-2-4-6-8-7-5-3-1/h1-2,7H,3-6,8H2
21 atoms
C  -2.002446 0.700915 0.072661
H  -2.176429 0.794584 1.148755
C  -1.751422 -0.967389 -0.171501
H  -2.627607 -1.382707 0.333662
C  -0.410732 -1.370595 0.378728
C  0.673393 -1.266852 -0.401749
C  1.983865 -0.707338 0.066288
H  2.179033 -0.930674 1.120421
H  2.845708 -1.038159 -0.521493
C  1.796276 0.831125 -0.123533
H  1.82986 1.093128 -1.186956
H  2.605556 1.377526 0.368249
C  0.438112 1.337379 0.49934
C  -0.753246 1.270249 -0.339465
H  0.515058 -1.192726 -1.482114
H  -1.832315 -1.140808 -1.246707
H  0.257377 0.901111 1.483863
H  -0.655054 1.628224 -1.369036
H  -2.868236 0.991594 -0.523825
H  0.560798 2.434492 0.646493
H  -0.316668 -1.444179 1.461748
totalener: -311.14407607 hartree
nucrepener: 379.09690709 hartree
electener: -690.24098316 hartree
oneelecener: -1158.64305500 hartree
twoeener: 468.40207184 hartree
kineticenergy: 309.99473726 hartree
exchangeener: -12.754992943891 hartree
correlationener: -0.942826752813 hartree
xcener: -13.697819696703 hartree
chargesum: 1.0000000
charge: -0.256775 0.193273 -0.208422 0.187235 -0.198773 -0.121194 -0.208538 0.153839 0.164531 -0.266553 0.154081 0.172098 -0.157103 0.121004 0.141513 0.182468 0.162081 0.219324 0.192046 0.206481 0.167384
charge: -0.173236 0.168962 -0.137285 0.154497 -0.168749 -0.137247 -0.218641 0.149026 0.149893 -0.196891 0.143418 0.150523 -0.203167 0.169797 0.151082 0.151580 0.161779 0.176347 0.158994 0.200517 0.148800
qa: -0.2568 0.1933 -0.2084 0.1872 -0.1988 -0.1212 -0.2085 0.1538 0.1645 -0.2666 0.1541 0.1721 -0.1571 0.1210 0.1415 0.1825 0.1621 0.2193 0.1920 0.2065 0.1674
va: 3.8712 0.9602 3.8398 0.9617 3.8653 3.8449 3.8764 0.9733 0.9724 3.9017 0.9682 0.9641 3.8231 3.5042 0.9685 0.9618 0.9830 0.9390 0.9659 0.9511 0.9654
total: -311.824493583 hartree
energy: -311.824493582726
dipole: 0.29693 -1.10305 -0.80612 1.95807 -0.55509 1.40298 0.21821 -0.40666 -0.18845
magnitude: 1.62902 au
magnitude: 4.14063 debye
