program: Orca
programVersion: 5.0.3
elementType: C H C H C C C H H C H H C C H H H H H H H
charge: 1
multiplicity: 1
keywords: DSD-PBEP86/2013 def2-TZVP RIJCOSX verytightscf def2-TZVP/C def2/J soscf noTRAH
formula: C8H13
InChI: InChI=1/C8H13/c1-2-4-6-8-7-5-3-1/h1-2,7H,3-6,8H2
21 atoms
C  -1.994127 0.608547 0.082701
H  -2.172109 0.775426 1.151573
C  -1.810828 -0.953487 -0.171905
H  -2.64514 -1.468845 0.312898
C  -0.431387 -1.322684 0.359378
C  0.657064 -1.248075 -0.429888
C  1.954721 -0.701746 0.07172
H  2.130073 -0.942247 1.125348
H  2.821724 -1.034348 -0.509255
C  1.817333 0.844649 -0.107612
H  1.856306 1.102733 -1.171999
H  2.644689 1.366595 0.381289
C  0.471331 1.401352 0.507884
C  -0.70269 1.198012 -0.325473
H  0.523247 -1.246903 -1.514297
H  -1.868134 -1.147837 -1.2476
H  0.31711 1.050983 1.530866
H  -0.612333 1.52826 -1.365368
H  -2.831999 0.990274 -0.508673
H  0.617226 2.501969 0.532884
H  -0.31544 -1.372397 1.442889
totalener: -311.15274815 hartree
nucrepener: 379.93423285 hartree
electener: -691.08698100 hartree
oneelecener: -1160.29585855 hartree
twoeener: 469.20887755 hartree
kineticenergy: 309.99603915 hartree
exchangeener: -12.756381295885 hartree
correlationener: -0.943431222325 hartree
xcener: -13.699812518210 hartree
chargesum: 1.0000000
charge: -0.211627 0.179381 -0.215773 0.178446 -0.177093 -0.145839 -0.211781 0.156174 0.165661 -0.254415 0.153188 0.174356 -0.162206 0.110145 0.156332 0.169756 0.163562 0.217051 0.184017 0.204797 0.165867
charge: -0.190113 0.165666 -0.184983 0.151740 -0.129524 -0.141049 -0.220063 0.149892 0.152798 -0.193001 0.144224 0.150463 -0.209197 0.203143 0.152644 0.152560 0.159706 0.175859 0.161080 0.197278 0.150877
qa: -0.2116 0.1794 -0.2158 0.1784 -0.1771 -0.1458 -0.2118 0.1562 0.1657 -0.2544 0.1532 0.1744 -0.1622 0.1101 0.1563 0.1698 0.1636 0.2171 0.1840 0.2048 0.1659
va: 3.8454 0.9648 3.8569 0.9673 3.8695 3.8462 3.8862 0.9725 0.9717 3.8824 0.9695 0.9629 3.8423 3.4846 0.9656 0.9696 0.9786 0.9372 0.9673 0.9543 0.9644
total: -311.832121007 hartree
energy: -311.832121006901
dipole: 0.43584 -1.05480 -0.61895 1.96943 -0.62251 1.34692 0.15025 -0.33181 -0.18155
magnitude: 1.49340 au
magnitude: 3.79593 debye
