program: Orca
programVersion: 5.0.3
elementType: C H C H C C C H H C H H C C H H H H H H H
charge: 1
multiplicity: 1
keywords: DSD-PBEP86/2013 def2-TZVP D3BJ RIJCOSX verytightscf def2-TZVP/C def2/J soscf noTRAH
formula: C8H13
InChI: InChI=1/C8H13/c1-2-4-6-8-7-5-3-1/h1-2,7H,3-6,8H2
21 atoms
C  -2.00197 0.725193 0.080165
H  -2.204074 0.872898 1.144801
C  -1.760391 -0.93026 -0.144376
H  -2.618968 -1.362239 0.374648
C  -0.429274 -1.358053 0.408428
C  0.697374 -1.284624 -0.36437
C  2.008756 -0.687103 0.070293
H  2.222232 -0.879183 1.127246
H  2.859223 -1.021984 -0.527542
C  1.801429 0.896845 -0.144118
H  1.860356 1.132513 -1.211864
H  2.615363 1.424907 0.356605
C  0.424744 1.270473 0.439122
C  -0.743904 1.319491 -0.371155
H  0.530649 -1.20911 -1.443501
H  -1.850199 -1.127057 -1.214974
H  0.077693 0.204773 0.760008
H  -0.604998 1.347041 -1.456239
H  -2.869116 0.991844 -0.524981
H  0.367998 1.716631 1.440555
H  -0.347488 -1.517718 1.485737
totalener: -311.08962305 hartree
nucrepener: 381.28583886 hartree
electener: -692.37546192 hartree
oneelecener: -1162.77319669 hartree
twoeener: 470.39773477 hartree
kineticenergy: 309.96569616 hartree
exchangeener: -14.117165866400 hartree
correlationener: -0.946620475202 hartree
xcener: -15.063786341602 hartree
chargesum: 1.0000000
charge: -0.220721 0.179026 -0.279545 0.189908 -0.095188 -0.118119 -0.197591 0.159045 0.170594 -0.321446 0.166732 0.176582 -0.021952 0.031969 0.146708 0.178614 0.055371 0.192019 0.190669 0.227018 0.190307
charge: -0.179686 0.158405 -0.164103 0.158051 -0.201139 -0.091571 -0.206720 0.149346 0.149495 -0.197321 0.145039 0.151494 -0.206400 0.095548 0.154191 0.151018 0.265956 0.170483 0.158431 0.183244 0.156237
qa: -0.2207 0.1790 -0.2795 0.1899 -0.0952 -0.1181 -0.1976 0.1590 0.1706 -0.3214 0.1667 0.1766 -0.0220 0.0320 0.1467 0.1786 0.0554 0.1920 0.1907 0.2270 0.1903
va: 3.8302 0.9686 3.9565 0.9598 3.6627 3.9350 3.8356 0.9723 0.9709 3.9667 0.9640 0.9702 3.5436 3.7528 0.9666 0.9630 1.1156 0.9510 0.9641 0.9489 0.9598
total: -311.753519678 hartree
dispcorr: -0.014437018 hartree
energy: -311.767956696168
dipole: 0.03627 -0.58324 -0.54697 0.53777 0.23460 0.77237 0.29124 -0.38417 -0.09293
magnitude: 0.95099 au
magnitude: 2.41721 debye
