program: Orca
programVersion: 5.0.3
elementType: C H C H C C C H H C H H C C H H H H H H H
charge: 1
multiplicity: 1
keywords: b3lyp def2-TZVP EnGrad RIJCOSX verytightscf def2/J soscf
formula: C8H13
InChI: InChI=1/C8H13/c1-2-4-6-8-7-5-3-1/h1-2,7H,3-6,8H2
21 atoms
C  -1.995221 0.537615 0.118954
H  -2.171306 0.726678 1.181607
C  -1.931618 -0.989711 -0.1731
H  -2.67332 -1.574543 0.374354
C  -0.503093 -1.177802 0.293083
C  0.617421 -1.148855 -0.494371
C  1.910879 -0.661294 0.068492
H  2.0208 -0.951276 1.118854
H  2.772209 -1.042598 -0.487237
C  1.877982 0.901107 -0.0480
H  1.981933 1.184825 -1.102089
H  2.72902 1.334438 0.484306
C  0.546851 1.480223 0.497311
C  -0.573104 0.895092 -0.277865
H  0.533382 -1.307423 -1.56921
H  -2.03409 -1.191814 -1.243662
H  0.423874 1.328138 1.574178
H  -0.438927 0.962746 -1.360449
H  -2.740441 1.07935 -0.473624
H  0.553423 2.569211 0.317208
H  -0.356299 -1.130963 1.373666
totalener: -312.24974689 hartree
nucrepener: 384.25037793 hartree
electener: -696.50012482 hartree
oneelecener: -1169.44628740 hartree
twoeener: 472.94616259 hartree
kineticenergy: 310.54428585 hartree
exchangeener: -36.338348737661 hartree
correlationener: -2.307466673277 hartree
xcener: -38.645815410937 hartree
chargesum: 1.0000000
charge: -0.184843 0.153703 -0.187403 0.166499 -0.057261 -0.057133 -0.207872 0.149531 0.163393 -0.218477 0.144593 0.163012 -0.160000 -0.025915 0.181848 0.149489 0.143647 0.177524 0.166672 0.178168 0.160824
charge: -0.198126 0.155606 -0.191690 0.152219 -0.057628 -0.053827 -0.209438 0.155950 0.160427 -0.205437 0.149419 0.153682 -0.222408 0.057794 0.162957 0.154513 0.155232 0.170556 0.157358 0.185137 0.167705
qa: -0.1848 0.1537 -0.1874 0.1665 -0.0573 -0.0571 -0.2079 0.1495 0.1634 -0.2185 0.1446 0.1630 -0.1600 -0.0259 0.1818 0.1495 0.1436 0.1775 0.1667 0.1782 0.1608
va: 3.8568 0.9725 3.8444 0.9713 3.8075 3.7878 3.8861 0.9680 0.9696 3.8509 0.9686 0.9656 3.8778 3.6819 0.9560 0.9732 0.9734 0.9552 0.9695 0.9624 0.9653
energy: -312.249746886705
dipole: 0.56251 -0.77008 -0.20756 1.85977 -1.57190 0.28786 0.17592 -0.31341 -0.13749
magnitude: 0.38060 au
magnitude: 0.96740 debye
