program: Orca
programVersion: 5.0.3
charge: 1
multiplicity: 1
keywords: DLPNO-CCSD(T1) tightPNO Extrapolate(3/4,def2) RIJK def2/JK verytightSCF miniprint nopop
formula: C8H13
InChI: InChI=1/C8H13/c1-2-4-6-8-7-5-3-1/h1-2,7H,3-6,8H2
21 atoms
C  -2.001764 0.752252 0.069165
H  -2.164417 0.815853 1.147761
C  -1.730751 -0.974382 -0.164098
H  -2.619331 -1.332284 0.36024
C  -0.412123 -1.386603 0.388901
C  0.682611 -1.271953 -0.385202
C  1.997516 -0.697756 0.062722
H  2.202014 -0.904417 1.118685
H  2.85381 -1.036509 -0.527019
C  1.787761 0.843258 -0.134536
H  1.822322 1.107073 -1.19739
H  2.592337 1.39404 0.359869
C  0.424648 1.283483 0.495682
C  -0.766325 1.292679 -0.36163
H  0.517604 -1.192091 -1.464391
H  -1.829787 -1.133964 -1.238435
H  0.214137 0.714586 1.404848
H  -0.659065 1.629588 -1.396462
H  -2.882418 0.997732 -0.522861
H  0.503054 2.339998 0.835212
H  -0.327217 -1.4754 1.471163
e0: -310.282958276 hartree
corrType: DLPNO BASED
e0: -310.296661458 hartree
basis: def2-TZVPP def2-QZVPP
scfener: -310.282958276 -310.296661458
corrmethod: MDCI MDCI
correner: -1.450125477 -1.520578129
corrcbsextra: -1.572765239
energy: -311.871314155295
dipole: 0.20886 -1.09847 -0.88961 1.80194 -0.49588 1.30606 0.32886 -0.54660 -0.21773
magnitude: 1.59518 au
magnitude: 4.05463 debye
