program: Orca
programVersion: 5.0.3
elementType: C H C H C C C H H C H H C C H H H H H H H
charge: 1
multiplicity: 1
keywords: m062x def2-TZVP EnGrad RIJCOSX verytightscf def2/J soscf
formula: C8H13
InChI: InChI=1/C8H13/c1-2-4-6-8-7-5-3-1/h1-2,7H,3-6,8H2
21 atoms
C  -1.99973 0.656657 0.075954
H  -2.176822 0.789625 1.149028
C  -1.776259 -0.9550 -0.171945
H  -2.634828 -1.422914 0.318592
C  -0.416015 -1.352295 0.371758
C  0.667402 -1.26164 -0.412993
C  1.972108 -0.707165 0.069147
H  2.160808 -0.937577 1.12277
H  2.836899 -1.035318 -0.517111
C  1.805138 0.834445 -0.11751
H  1.839896 1.093928 -1.181518
H  2.62014 1.373606 0.373017
C  0.449934 1.365511 0.502228
C  -0.734272 1.244879 -0.332138
H  0.51779 -1.210996 -1.495325
H  -1.842668 -1.141922 -1.247337
H  0.281986 0.970285 1.50603
H  -0.643446 1.603454 -1.362534
H  -2.853884 0.989091 -0.518579
H  0.590598 2.466192 0.586044
H  -0.313465 -1.419816 1.454982
totalener: -312.28106426 hartree
nucrepener: 379.38399888 hartree
electener: -691.66506315 hartree
oneelecener: -1159.60141478 hartree
twoeener: 467.93635164 hartree
kineticenergy: 310.38454962 hartree
xcener: -23.089287286594 hartree
chargesum: 1.0000000
charge: -0.334999 0.226627 -0.298193 0.206713 -0.181716 -0.118565 -0.332353 0.199004 0.195015 -0.310297 0.201254 0.198657 -0.275506 0.145828 0.174695 0.214142 0.206577 0.241586 0.209985 0.239119 0.192425
charge: -0.185912 0.174694 -0.168287 0.159007 -0.155256 -0.149015 -0.228594 0.155722 0.158335 -0.199981 0.151032 0.156820 -0.209654 0.151664 0.156102 0.157689 0.166203 0.178506 0.166201 0.211287 0.153438
qa: -0.3350 0.2266 -0.2982 0.2067 -0.1817 -0.1186 -0.3324 0.1990 0.1950 -0.3103 0.2013 0.1987 -0.2755 0.1458 0.1747 0.2141 0.2066 0.2416 0.2100 0.2391 0.1924
va: 3.7582 0.9380 3.7132 0.9540 3.6723 3.6528 3.7577 0.9510 0.9597 3.7106 0.9441 0.9540 3.7029 3.3493 0.9559 0.9443 0.9559 0.9264 0.9577 0.9366 0.9544
energy: -312.281064261927
dipole: 0.35872 -1.03416 -0.67544 1.98254 -0.59918 1.38336 0.17605 -0.32078 -0.14473
magnitude: 1.54624 au
magnitude: 3.93022 debye
