program: Gaussian 09
title: 000051063
version: EM64L-G09RevD.01
frameworkgroup: C1[X(C15H22N2)]
method: RPBEPBE
basis: SDD
operation: Freq
keyword: #pfreq=noraman
keyword: PBEPBE/SDD
title: #p freq=noraman PBEPBE/SDD
converged: YES YES NO NO
title: Mulliken charges:
elementType: N N C C C C C C C C C C C C C C C H H H H H H H H H H H H H H H H H H H H H H
charge: -0.103243 -0.282584 -0.542251 0.279999 -0.369549 0.213604 0.454423 -0.315867 -0.323554 -0.564073 -0.221802 -0.832841 -0.402507 -0.675610 -0.674811 -0.245681 -0.221614 0.217941 0.226972 0.206794 0.216378 0.189648 0.203474 0.189413 0.203520 0.260515 0.246608 0.225901 0.233659 0.229205 0.240638 0.227755 0.208001 0.205700 0.226997 0.208169 0.208361 0.221615 0.230695
chargesum: 0.00000
title: Mulliken charges with hydrogens summed into heavy atoms:
elementType: N N C C C C C C C C C C C C C C C
charge: -0.103243 -0.282584 -0.097338 0.279999 0.053623 0.213604 0.454423 0.077255 0.069378 -0.303558 0.024806 -0.144075 -0.161868 -0.034154 -0.031284 -0.024066 0.009081
polarizability: 2.20296744e+02 2.30512620e+01 2.13733305e+02 1.07373724e+01 -9.71832985e+00 1.11401902e+02
1716.lowfreq: -5.2870 -0.0002 0.0004 0.0004 4.9509 8.5992 19.8591 28.8647 54.6910
frequency: 19.8165 28.6796 54.6489 68.7529 78.5806 83.7681 85.6134 130.0919 165.3262 169.7957 212.1290 231.8643 254.4713 269.3078 281.9485 293.2058 305.5332 350.9894 402.1824 434.5422 442.9442 476.4744 493.0565 509.7678 572.0974 585.2323 647.9751 655.8625 713.8651 719.0214 733.4832 752.3380 778.3902 785.9280 795.4615 801.7319 826.0236 839.9765 904.1097 919.0554 921.3351 957.0029 982.5781 982.9615 1008.0752 1018.8363 1041.4782 1052.0394 1069.3744 1074.5575 1084.3852 1097.9098 1114.9044 1135.1443 1154.6728 1162.8175 1182.9373 1204.6567 1223.5310 1262.8982 1274.5359 1284.8876 1289.9685 1296.2382 1314.8918 1345.6253 1358.6303 1363.4469 1366.7937 1372.5775 1386.4163 1389.0018 1400.3586 1437.7254 1445.6959 1460.4406 1462.6043 1469.0927 1471.7629 1473.6327 1478.2329 1482.9268 1487.1351 1487.4831 1490.2635 1523.7253 1527.9318 1547.3557 1637.5930 2851.2481 2857.9727 2876.5140 2969.9364 2980.8443 2981.9943 2982.6312 3026.1121 3029.9201 3031.1726 3042.1708 3053.0912 3072.2478 3074.2657 3082.7373 3090.4555 3091.2331 3145.4383 3158.9923 3172.1106 3190.1331 3212.6014
redmass: 3.5410 3.8045 3.1826 1.0508 2.8154 2.4397 2.1605 3.3339 1.5865 3.0934 1.3311 1.9334 1.9425 2.1823 2.5617 2.4708 3.2981 3.5322 3.0470 2.8948 2.7955 2.7341 5.3049 2.9678 3.6928 4.8089 4.5465 3.9011 3.4818 2.9176 1.3846 1.8353 1.6555 1.4260 1.1337 1.3531 1.4729 3.1386 2.7723 1.4647 2.0422 1.2897 1.7294 1.9547 2.3688 3.2810 1.5159 2.0978 2.6499 1.9154 2.0996 2.2583 1.8471 1.5548 1.4535 1.3350 1.6065 2.2564 1.6373 1.7299 1.2117 1.2055 1.2670 1.4146 3.5700 1.9696 1.3272 1.4208 2.0392 1.4006 1.2330 1.2326 1.2506 2.8390 2.4737 1.0843 1.0570 1.1312 1.0631 1.0687 1.0546 1.1049 1.1960 1.1648 1.0769 5.3493 5.8716 5.8122 6.5131 1.0721 1.0716 1.0711 1.0381 1.0357 1.0359 1.0624 1.0866 1.0884 1.0887 1.0976 1.0970 1.0983 1.0981 1.0972 1.1004 1.1002 1.0861 1.0898 1.0958 1.0999 1.0975
irintensity: 0.1000 0.0243 0.0789 0.3492 0.2828 0.2938 0.0326 2.0524 0.9144 0.8133 0.3051 1.0194 0.9471 0.6823 0.6667 1.4358 1.5879 1.4231 12.9931 5.8145 3.0928 4.8570 0.0858 0.8495 4.6402 7.1215 1.7748 2.8536 2.4327 3.0376 73.2499 0.6836 8.0437 57.4153 5.4196 6.4100 12.8340 2.2747 0.4314 1.9421 0.6485 0.8316 3.8184 5.1378 5.5081 2.3318 5.8098 13.0080 49.5841 16.3535 2.3000 26.3299 7.6519 10.4203 11.0153 4.7641 4.3432 34.5704 8.1803 2.8038 4.0311 6.7356 29.7185 15.9583 52.1410 7.8298 5.9495 8.1004 13.5245 1.7962 19.3046 22.1019 10.0632 14.8808 5.1370 5.0683 5.4762 3.4557 7.1894 8.2144 2.8884 16.0423 0.4654 20.6151 12.3535 0.9530 3.5817 12.1542 1.5211 29.8446 110.6842 141.1373 45.7307 29.6927 34.1355 31.9851 11.9484 8.6062 18.9683 24.9489 34.5484 51.3863 83.7259 24.4496 30.4080 51.2426 0.5164 8.2696 21.5139 10.3627 3.2248
temp: 298.150 k
press: 1.00000 atm
elementType: 7 7 6 6 6 6 6 6 6 6 6 6 6 6 6 6 6 1 1 1 1 1 1 1 1 1 1 1 1 1 1 1 1 1 1 1 1 1 1
symmnumber: 1
zpe: 884679.9 jmol-1
zpe.correction: 0.336957 hartree
zpe.thermalcorrener: 0.354934 hartree
zpe.thermalcorrenthalpy: 0.355878 hartree
zpe.thermalcorrgfe: 0.289382 hartree
zpe.sumelectzpe: -692.985311 hartree
zpe.sumelectthermal: -692.967334 hartree
zpe.sumelectthermalent: -692.966390 hartree
zpe.sumelectthermalfe: -693.032886 hartree
dipole: 1.4356 -0.1241 -0.5332
dipole: 1.5364
quadrupole: -98.7295 -96.7114 -108.6643
quadrupole: 1.9755 -0.0107 -1.2022
quadrupole: 2.6389 4.6570 -7.2959 1.9755 -0.0107 -1.2022
hfenergy: -693.3222679 hartree
pointgroup: C01 [X(C15H22N2)]
dipole: 0.5711038 0.0402225 0.1939668 debye
polarizability: 220.5134604|-21.2448713|213.2408651|-17.4738376|3.3208836|111.6776256 unknown
InChI: InChI=1S/C15H22N2/c1-4-16(5-2)11-9-15-13(3)12-14-8-6-7-10-17(14)15/h6-8,10,12H,4-5,9,11H2,1-3H3
charge 0 multiplicity 1
39 atoms
N  3.047425 0.304117 0.079775
N  -1.573655 0.134258 -0.112833
C  0.802623 -0.563369 -0.688204
C  -0.616316 -0.872137 -0.300901
C  1.684512 -0.097185 0.508714
C  -1.243402 -2.111692 -0.020467
C  -2.823195 -0.466659 0.285009
C  3.949225 -0.8622 -0.128152
C  3.650179 1.348409 0.952035
C  -2.602798 -1.86082 0.339737
C  -1.455795 1.514599 -0.270255
C  -0.573437 -3.462177 -0.101719
C  -3.937245 0.389681 0.516974
C  5.072782 -0.581244 -1.144542
C  3.057611 2.749848 0.708424
C  -2.551471 2.333414 -0.042696
C  -3.813607 1.772191 0.359531
H  1.246966 -1.468909 -1.140483
H  0.853512 0.224368 -1.465827
H  1.706212 -0.906063 1.280437
H  1.197953 0.772075 0.987108
H  4.391427 -1.210622 0.840057
H  3.336344 -1.701099 -0.507152
H  3.556999 1.080401 2.035447
H  4.732905 1.384764 0.732752
H  -3.34899 -2.607036 0.607846
H  -0.479696 1.892516 -0.582331
H  0.287784 -3.538568 0.589425
H  -1.281278 -4.266819 0.160604
H  -0.194759 -3.672438 -1.120489
H  -4.886369 -0.063913 0.818824
H  4.639252 -0.296437 -2.118892
H  5.732999 0.241463 -0.814273
H  5.703027 -1.479728 -1.283598
H  3.194478 3.039539 -0.348048
H  1.976565 2.787369 0.937229
H  3.558026 3.498602 1.350736
H  -2.437762 3.412978 -0.174464
H  -4.668833 2.430622 0.538662
