program: Orca
programVersion: 5.0.3
charge: 1
multiplicity: 1
keywords: DLPNO-CCSD(T1) tightPNO Extrapolate(3/4,def2) RIJK def2/JK verytightSCF miniprint nopop
formula: C8H13
InChI: InChI=1/C8H13/c1-2-4-6-8-7-5-3-1/h1-2,7H,3-6,8H2
21 atoms
C  -1.990054 0.575349 0.095461
H  -2.166869 0.75438 1.161619
C  -1.848632 -0.965627 -0.173966
H  -2.656941 -1.508096 0.324161
C  -0.45304 -1.285713 0.340046
C  0.642879 -1.223973 -0.451261
C  1.935482 -0.690686 0.072676
H  2.089711 -0.945078 1.126489
H  2.804098 -1.036618 -0.497383
C  1.83277 0.860538 -0.091529
H  1.883283 1.122486 -1.154874
H  2.673758 1.356827 0.401119
C  0.498557 1.438219 0.511517
C  -0.662231 1.121962 -0.315809
H  0.527869 -1.283846 -1.534836
H  -1.913412 -1.162243 -1.24905
H  0.355978 1.150183 1.556143
H  -0.554564 1.365128 -1.377673
H  -2.806075 1.008187 -0.493693
H  0.620811 2.539222 0.470826
H  -0.324589 -1.298607 1.423709
e0: -310.306036766 hartree
corrType: DLPNO BASED
e0: -310.319726500 hartree
basis: def2-TZVPP def2-QZVPP
scfener: -310.306036765 -310.319726500
corrmethod: MDCI MDCI
correner: -1.445796416 -1.516263874
corrcbsextra: -1.568461953
energy: -311.890074058815
dipole: 0.49948 -1.08577 -0.58630 1.93027 -0.75654 1.17373 0.14651 -0.34789 -0.20138
magnitude: 1.32738 au
magnitude: 3.37394 debye
