program: Orca
programVersion: 5.0.3
elementType: C H C H C C C H H C H H C C H H H H H H H
charge: 1
multiplicity: 1
keywords: DSD-PBEP86/2013 def2-TZVP RIJCOSX verytightscf def2-TZVP/C def2/J soscf noTRAH
formula: C8H13
InChI: InChI=1/C8H13/c1-2-4-6-8-7-5-3-1/h1-2,7H,3-6,8H2
21 atoms
C  -1.992145 0.594858 0.086654
H  -2.169817 0.767721 1.15442
C  -1.824091 -0.957262 -0.172548
H  -2.649435 -1.483708 0.315425
C  -0.438737 -1.310247 0.353166
C  0.652091 -1.240618 -0.437149
C  1.947656 -0.698307 0.072268
H  2.116063 -0.943346 1.126022
H  2.815366 -1.03504 -0.505152
C  1.822499 0.849781 -0.102607
H  1.864576 1.108581 -1.166831
H  2.65496 1.363283 0.386721
C  0.48087 1.415081 0.509808
C  -0.688948 1.174377 -0.322497
H  0.524977 -1.261155 -1.521682
H  -1.882465 -1.152738 -1.248133
H  0.331212 1.084936 1.540414
H  -0.594307 1.479776 -1.369577
H  -2.823026 0.994399 -0.503798
H  0.62169 2.515854 0.512401
H  -0.318097 -1.347959 1.436846
totalener: -311.15468991 hartree
nucrepener: 380.20069652 hartree
electener: -691.35538642 hartree
oneelecener: -1160.82088837 hartree
twoeener: 469.46550194 hartree
kineticenergy: 309.99696082 hartree
exchangeener: -12.756614652150 hartree
correlationener: -0.943622680369 hartree
xcener: -13.700237332519 hartree
chargesum: 1.0000000
charge: -0.208283 0.177284 -0.213688 0.177823 -0.169997 -0.146289 -0.214086 0.156532 0.166311 -0.251035 0.152596 0.174535 -0.166169 0.104236 0.160469 0.167980 0.163342 0.215177 0.183302 0.204077 0.165881
charge: -0.192389 0.164110 -0.189187 0.151394 -0.121217 -0.136991 -0.220050 0.150154 0.153274 -0.193990 0.144402 0.150466 -0.211041 0.201654 0.153391 0.152698 0.159030 0.175484 0.161083 0.195697 0.152030
qa: -0.2083 0.1773 -0.2137 0.1778 -0.1700 -0.1463 -0.2141 0.1565 0.1663 -0.2510 0.1526 0.1745 -0.1662 0.1042 0.1605 0.1680 0.1633 0.2152 0.1833 0.2041 0.1659
va: 3.8426 0.9658 3.8565 0.9679 3.8706 3.8479 3.8895 0.9723 0.9715 3.8784 0.9700 0.9629 3.8502 3.4939 0.9648 0.9709 0.9776 0.9379 0.9676 0.9551 0.9643
total: -311.834304261 hartree
energy: -311.834304260684
dipole: 0.46068 -1.04585 -0.58517 1.95718 -0.68421 1.27297 0.14699 -0.32717 -0.18017
magnitude: 1.41256 au
magnitude: 3.59045 debye
