program: Gaussian 09
title: 000051017
version: EM64L-G09RevD.01
frameworkgroup: C1[X(C20H18O3)]
method: RPBEPBE
basis: SDD
operation: Freq
keyword: #pfreq=noraman
keyword: PBEPBE/SDD
title: #p freq=noraman PBEPBE/SDD
converged: YES YES NO NO
title: Mulliken charges:
elementType: O O O C C C C C C C C C C C C C C C C C C C C H H H H H H H H H H H H H H H H H H
charge: -0.431856 -0.430984 -0.446850 0.226957 -0.381475 0.196057 0.160523 0.148318 0.264296 0.041771 -0.203623 0.138132 -0.353066 -0.262549 -0.628173 -0.406343 0.417252 -0.886282 -0.517525 -0.358350 -0.450528 -0.267632 -0.253863 0.259586 0.219552 0.247607 0.232673 0.270979 0.215802 0.277863 0.273893 0.242734 0.226161 0.236073 0.260401 0.334046 0.242127 0.346039 0.227775 0.230264 0.342217
chargesum: 0.00000
title: Mulliken charges with hydrogens summed into heavy atoms:
elementType: O O O C C C C C C C C C C C C C C C C C C C C
charge: -0.097810 -0.084945 -0.104633 0.226957 -0.121889 0.196057 0.160523 0.148318 0.264296 0.041771 0.015929 0.138132 -0.105458 -0.029877 -0.141392 -0.128480 0.417252 -0.143493 -0.281451 -0.097949 -0.208401 -0.039858 -0.023599
polarizability: 4.04997240e+02 5.70243983e+00 2.46559216e+02 -4.08064664e+00 -7.08326441e+00 1.19515686e+02
1716.lowfreq: -5.4072 -5.1993 -0.0008 -0.0003 -0.0002 6.7687 36.9087 40.4512 55.4905
frequency: 36.8550 40.3956 55.4887 72.6337 80.2461 107.5624 130.0920 173.5160 196.8288 220.1955 232.9521 244.9115 262.6298 275.0134 279.6842 297.9112 315.8947 324.8296 339.5813 356.6366 380.5982 386.3620 400.1175 434.1147 440.9088 468.7240 506.2384 521.0677 528.1746 534.0412 556.3472 574.1007 602.1959 623.4385 636.2909 674.5115 691.9862 709.4715 750.4844 761.1045 765.1010 798.6109 800.5058 820.6813 860.5199 867.5141 884.4328 886.3740 918.9392 930.1675 939.9806 957.3691 967.8094 975.2252 980.4433 987.3638 990.9798 1030.4315 1035.5710 1041.4816 1046.0939 1060.0440 1091.5932 1118.9726 1151.3704 1173.5664 1177.4792 1178.8837 1192.9303 1196.9286 1199.8130 1221.8943 1237.7023 1264.9672 1286.8777 1301.9694 1311.9772 1326.2201 1347.6159 1366.2679 1373.7073 1383.7662 1391.6752 1396.5226 1398.7550 1409.3805 1425.3996 1435.2557 1448.9804 1480.0013 1500.3569 1505.8961 1514.9702 1520.2378 1562.7876 1587.1788 1612.9248 1625.7484 1639.5605 2967.8128 2972.5412 2979.3768 3019.5339 3039.6254 3061.1520 3102.8656 3121.4946 3128.2710 3134.7171 3134.8123 3158.2782 3161.7886 3167.9448 3196.1819 3519.7335 3540.6466 3545.8069
redmass: 5.5384 5.4815 4.9666 4.8058 4.9114 3.6724 5.2321 5.3604 4.4137 3.7710 4.3163 4.2277 4.1367 1.4786 1.1730 1.1488 1.2220 2.7585 3.9103 3.3948 3.1696 2.8191 4.2844 3.6592 5.2025 4.1784 4.4020 3.7599 5.4930 3.8990 5.1445 3.7875 3.6391 4.8918 5.9884 4.4940 3.8641 4.6070 2.9080 1.5747 1.9764 3.9515 2.9196 1.6345 4.5797 4.0659 1.6039 3.7077 3.3625 6.2872 5.4068 1.4111 4.9191 1.4225 1.3077 2.2452 1.8327 1.8969 1.6519 2.1362 2.0830 2.7070 2.2152 1.9073 1.5030 1.1563 1.1116 1.2265 1.3030 1.1326 1.2157 1.4352 1.9950 1.6904 1.9364 2.0979 2.2985 1.3573 1.2977 2.4480 2.7208 2.3364 2.5998 1.6346 1.4575 2.3026 2.6789 2.6612 2.8067 1.1327 2.6347 1.2862 1.7569 1.6504 6.9787 7.7314 6.0195 6.8905 7.0095 1.0651 1.0447 1.0840 1.0855 1.0969 1.0905 1.0976 1.0867 1.0887 1.0892 1.0864 1.0984 1.0984 1.0956 1.0926 1.0658 1.0663 1.0663
irintensity: 0.9689 0.4735 0.3932 0.5136 2.6524 0.7923 6.3414 5.8311 1.1867 1.4381 1.8573 9.8134 15.2879 7.6127 151.2311 44.4943 90.7801 2.6856 14.9334 9.8906 8.4680 8.1922 4.3025 1.5880 1.7273 8.3883 1.7455 16.4986 1.7100 0.4273 4.2254 3.1981 3.4217 9.7310 1.2512 6.0454 29.5594 6.1764 3.2349 66.3380 9.3835 1.3924 9.7606 44.0196 28.8294 17.3282 6.1672 23.0916 39.5155 97.7727 72.3225 5.4690 18.6851 1.3050 0.6558 9.0186 4.4791 4.3807 6.5190 10.8935 5.6751 8.2472 13.2469 7.3924 36.5377 3.6953 27.8308 22.2631 3.4488 3.9607 50.7180 7.4975 3.9601 5.7515 9.1483 1.1793 3.4217 4.7631 41.4611 28.0415 0.4590 1.8725 2.5882 15.3060 5.9538 0.9820 4.7037 5.1691 2.3081 8.1000 12.0481 19.1515 14.4454 4.8048 4.3920 0.5353 2.9345 0.5434 7.4543 47.9373 23.5739 19.7821 49.0802 20.9092 17.0276 8.0752 1.5897 7.3114 12.9155 5.8188 44.2936 31.7281 12.2579 12.4161 5.0053 3.3523 13.1508
temp: 298.150 k
press: 1.00000 atm
elementType: 8 8 8 6 6 6 6 6 6 6 6 6 6 6 6 6 6 6 6 6 6 6 6 1 1 1 1 1 1 1 1 1 1 1 1 1 1 1 1 1 1
symmnumber: 1
zpe: 855823.4 jmol-1
zpe.correction: 0.325966 hartree
zpe.thermalcorrener: 0.345727 hartree
zpe.thermalcorrenthalpy: 0.346672 hartree
zpe.thermalcorrgfe: 0.278377 hartree
zpe.sumelectzpe: -996.955729 hartree
zpe.sumelectthermal: -996.935968 hartree
zpe.sumelectthermalent: -996.935023 hartree
zpe.sumelectthermalfe: -997.003318 hartree
dipole: 0.4606 0.0330 0.9595
dipole: 1.0648
quadrupole: -122.2462 -110.6399 -143.5746
quadrupole: -3.6820 -7.7890 3.4142
quadrupole: 3.2407 14.8469 -18.0877 -3.6820 -7.7890 3.4142
hfenergy: -997.281695 hartree
pointgroup: C01 [X(C20H18O3)]
dipole: 0.181902 0.020029 0.3768436 debye
polarizability: 405.1324589|2.9060653|245.9462009|-4.6559433|-10.4011981|119.9934815 unknown
InChI: InChI=1S/C20H18O3/c1-11-13-8-9-17(22)20(23)19(13)16(10-21)15-7-6-12-4-2-3-5-14(12)18(11)15/h2-9,17,20-23H,10H2,1H3
charge 0 multiplicity 1
41 atoms
O  -3.533677 0.620127 1.903819
O  -4.651547 -0.455054 -1.5033
O  -1.62728 3.372516 -0.938327
C  -1.864336 0.205055 0.231997
C  -3.357025 0.423287 0.440086
C  -1.351188 -1.127735 0.072248
C  -0.991188 1.302608 0.178384
C  0.96552 -0.257348 -0.007767
C  0.419646 1.082869 -0.000445
C  0.044289 -1.363531 -0.08655
C  -4.267494 -0.715949 -0.086859
C  2.433398 -0.398848 0.045792
C  -2.30592 -2.250383 0.091445
C  -3.66065 -2.085805 0.055545
C  -1.503262 2.713487 0.388614
C  1.293416 2.213082 -0.232422
C  3.26549 0.757398 -0.203282
C  0.49224 -2.766812 -0.486263
C  2.653391 2.050247 -0.391156
C  3.107146 -1.604411 0.427159
C  4.689122 0.637778 -0.199445
C  4.507225 -1.69575 0.456994
C  5.312288 -0.576702 0.108376
H  -3.686341 1.331737 -0.105275
H  -5.239327 -0.654708 0.43772
H  -1.904538 -3.266542 0.153945
H  -4.335321 -2.94838 0.072268
H  -2.475738 2.695313 0.911323
H  -0.795021 3.280132 1.027456
H  0.84288 3.201218 -0.355671
H  1.442345 -2.739564 -1.040564
H  -0.255487 -3.230193 -1.151467
H  0.625387 -3.447694 0.377793
H  3.29692 2.90778 -0.620007
H  2.531056 -2.467586 0.761873
H  -4.496612 0.787112 2.082558
H  5.28962 1.529662 -0.415077
H  -3.880658 -0.696819 -2.079679
H  4.980548 -2.634074 0.766705
H  6.404555 -0.657623 0.115458
H  -1.994974 4.284304 -0.804303
