program: Gaussian 09
title: 000051012
version: EM64L-G09RevD.01
frameworkgroup: C1[X(C8H5Cl3O2)]
method: RPBEPBE
basis: SDD
operation: Freq
keyword: #p
keyword: freq=noraman
keyword: PBEPBE/SDD
title: #p freq=noraman PBEPBE/SDD
converged: YES YES NO NO
title: Mulliken charges:
elementType: Cl Cl Cl O O C C C C C C C C H H H H H
charge: 0.021581 -0.017759 -0.039827 -0.255660 -0.194567 0.360657 -0.273837 -0.291244 -0.196923 -0.212710 -0.087970 0.218567 -0.455156 0.290024 0.289126 0.268386 0.281476 0.295836
chargesum: 0.00000
title: Mulliken charges with hydrogens summed into heavy atoms:
elementType: Cl Cl Cl O O C C C C C C C C
charge: 0.021581 -0.017759 -0.039827 -0.255660 -0.194567 0.360657 -0.273837 -0.001219 0.092204 0.055675 -0.087970 0.218567 0.122156
polarizability: 1.85585620e+02 1.00313724e+01 1.31166793e+02 1.82853355e+00 -2.14964094e+00 6.10793219e+01
1716.lowfreq: -7.2833 0.0026 0.0031 0.0036 6.2727 7.7463 22.2533 37.9763 63.1408
frequency: 22.1586 37.9380 63.1320 83.3809 144.9791 161.9350 186.4491 234.3425 281.7270 291.2702 331.7875 378.0366 380.8923 440.8949 506.9095 518.5382 546.4689 632.7057 654.9305 666.6404 701.2698 748.7183 778.5518 839.5911 872.6472 941.2474 969.4137 980.3086 997.6670 1048.3435 1091.4673 1148.4546 1215.6602 1229.0378 1258.0027 1315.2032 1357.6761 1381.3936 1418.5933 1454.6455 1556.3306 1588.4418 1666.6459 3080.5425 3176.2746 3185.0661 3190.7869 3196.1064
redmass: 10.7361 13.5104 15.6792 9.2616 5.6060 5.9998 17.2100 9.3554 10.1217 4.8614 9.9803 6.1973 13.2487 3.2360 6.6245 7.8315 6.1879 6.5511 7.2234 5.0818 5.6998 4.3654 8.1624 1.4692 1.4123 7.2232 1.5201 1.3699 8.8686 3.0933 3.5438 1.3366 2.0042 1.4604 1.3285 1.1593 3.7321 6.7376 1.0974 2.5690 8.7567 7.0805 11.4385 1.0534 1.0897 1.0935 1.1162 1.0967
irintensity: 0.7791 0.6523 1.6468 0.9424 2.5502 0.1075 1.1761 1.9367 0.4974 5.4204 2.5669 27.0912 21.9876 11.3846 1.0282 20.3069 4.1475 95.7964 3.3263 59.9305 24.5276 13.4828 60.6776 33.8188 18.7976 43.9025 3.7062 0.7556 672.1997 58.0055 17.0723 21.2127 168.4250 30.5838 16.0044 19.7300 14.5392 12.5115 40.7130 55.8612 48.6538 184.6134 225.0508 24.3357 0.2245 1.2346 1.5929 1.1004
temp: 298.150 k
press: 1.00000 atm
elementType: 17 17 17 8 8 6 6 6 6 6 6 6 6 1 1 1 1 1
symmnumber: 1
zpe: 292805.2 jmol-1
zpe.correction: 0.111524 hartree
zpe.thermalcorrener: 0.124018 hartree
zpe.thermalcorrenthalpy: 0.124962 hartree
zpe.thermalcorrgfe: 0.069431 hartree
zpe.sumelectzpe: -1837.534630 hartree
zpe.sumelectthermal: -1837.522136 hartree
zpe.sumelectthermalent: -1837.521192 hartree
zpe.sumelectthermalfe: -1837.576723 hartree
dipole: -1.1750 -1.7159 2.0700
dipole: 2.9343
quadrupole: -97.5985 -95.4763 -95.0508
quadrupole: -1.8174 8.5132 -0.9155
quadrupole: -1.5566 0.5656 0.9910 -1.8174 8.5132 -0.9155
hfenergy: -1837.6461539 hartree
pointgroup: C01 [X(C8H5Cl3O2)]
dipole: 0.3737096 -0.6768957 -0.8572569 debye
dipolederiv: -0.0686093 0.069629 -0.0021167 0.0540054 -0.7064655 -0.0323493 -0.0014857 -0.0242894 -0.0162734 -0.8896011 0.2291246 0.05211 0.2104493 -0.1748807 -0.0180094 0.0384931 -0.0166845 -0.0467604 -0.4362282 -0.0951857 0.1085612 -0.1727287 -0.2367481 0.1463343 0.4488935 0.2113473 -0.5164222 -1.9658071 -0.6003504 0.2515927 -0.6323546 -0.68942 -0.0325764 -0.2692962 -0.1421453 -0.3595979 -0.8298718 0.2207872 0.0848741 0.0940887 -0.73903 -0.1108261 -0.0405425 -0.1746393 -0.3060802 -0.9557804 0.064049 0.0725616 0.1328311 -0.339032 -0.035349 0.0393603 -0.0340894 0.0121838 0.4950239 -0.3330525 -0.0466279 0.1416221 1.1157298 0.0274518 0.0328757 0.0592872 -0.0510644 0.242633 -0.0072955 -0.0073244 -0.3300361 0.0522853 0.0270706 -0.0831094 0.0133959 -0.0744485 -0.4583775 0.3467953 0.0412774 0.3109573 -0.4421946 -0.038223 0.0324693 -0.0303872 -0.0638193 -0.6124503 -0.0690193 0.0196758 -0.0587694 -0.0185751 0.0124484 0.0125758 0.0089494 -0.1131857 1.3759594 -0.283356 -0.0727216 -0.3053374 0.4564374 0.0497538 -0.0607561 0.0403698 -0.038935 2.3435145 0.1631373 -0.1240664 0.5042804 1.2373681 0.1808662 0.2730544 0.358307 0.296094 1.4740835 0.4177407 -0.4226856 0.0890087 0.3269467 -0.1961895 -0.5493184 -0.300444 0.859126 0.0976812 -0.0374779 -0.0030998 -0.0590871 0.0495878 0.0030207 0.0097188 -0.0096356 0.1521401 0.0581933 -0.03131 0.0025656 -0.0357488 0.0635169 -0.006345 -0.0010865 -0.0030622 0.1695302 0.0773838 0.0365098 0.0069461 0.0373101 -0.0051507 -0.0143833 0.0101671 -0.0111286 0.1684002 -0.0009639 -0.0540257 0.0105411 -0.0902761 0.0528415 -0.013908 0.0084697 -0.0075542 -0.077749 0.0532171 -0.0367001 0.027937 0.1097853 -0.0032167 0.0512132 0.099517 0.0624033 0.006862 unknown
polarizability: 184.503932|-8.1279821|130.6628109|-14.3882956|1.8805161|62.6649915 unknown
InChI: InChI=1S/C8H5Cl3O2/c9-4-13-8(12)6-2-1-5(10)3-7(6)11/h1-3H,4H2
charge 0 multiplicity 1
18 atoms
Cl 0.743632 2.953909 0.251025
Cl 4.512641 -1.024425 -0.109641
Cl -4.148933 -1.12037 1.650813
O  -2.202764 -0.578839 -0.215149
O  -1.921376 1.615316 0.560105
C  0.040544 0.200807 0.100273
C  1.076161 1.177638 0.142338
C  0.426197 -1.16652 -0.01577
C  2.435899 0.811392 0.075405
C  1.775164 -1.555756 -0.077566
C  2.764272 -0.552669 -0.029945
C  -1.402584 0.544883 0.197018
C  -3.621614 -0.446422 -0.036823
H  -0.362658 -1.920777 -0.04963
H  3.21466 1.577105 0.103823
H  2.052178 -2.609599 -0.158901
H  -4.10253 -1.086758 -0.784181
H  -3.942887 0.604384 -0.048192
