program: Gaussian 09
title: 000051003
version: EM64L-G09RevD.01
frameworkgroup: C1[X(C9H14N2OS)]
method: RPBEPBE
basis: SDD
operation: Freq
keyword: #p
keyword: freq=noraman
keyword: PBEPBE/SDD
title: #p freq=noraman PBEPBE/SDD
converged: YES YES NO NO
title: Mulliken charges:
elementType: S O N N C C C C C C C C C H H H H H H H H H H H H H H
charge: 0.165548 -0.266847 -0.291539 -0.583054 -0.643865 -0.296654 -0.222600 -0.239011 -0.187917 0.329941 -0.336769 -0.340886 -0.538512 0.242455 0.276672 0.245320 0.190662 0.250760 0.252292 0.241672 0.252420 0.244192 0.265773 0.300832 0.220938 0.246023 0.222152
chargesum: 0.00000
title: Mulliken charges with hydrogens summed into heavy atoms:
elementType: S O N N C C C C C C C C C
charge: 0.165548 -0.266847 -0.047347 -0.016449 -0.124739 0.139329 -0.222600 0.011750 0.064375 0.329941 -0.095096 -0.088465 0.150601
polarizability: 2.13075904e+02 -9.45018569e+00 9.87901592e+01 -9.26835877e+00 -1.13901417e+01 1.04237004e+02
1716.lowfreq: -12.6392 -6.4756 -4.5009 -0.0013 0.0003 0.0024 10.5827 30.1437 39.9080
frequency: 9.4636 30.0760 39.8410 75.8421 87.4597 103.8554 139.5893 172.5770 187.6869 232.9196 276.9581 291.3577 335.6220 364.2357 372.8326 405.0565 417.7183 472.2515 483.7769 521.4881 600.9856 626.9973 689.0073 713.6484 727.8680 770.8532 792.9484 812.9231 834.4351 942.3588 964.0439 985.5540 987.3365 993.3724 1043.8951 1058.1150 1075.5924 1100.3201 1112.0038 1151.2660 1155.3838 1168.1806 1170.5718 1224.9154 1229.9734 1236.2322 1262.2439 1283.5252 1352.3483 1361.1202 1403.7397 1434.8564 1454.3185 1467.3400 1467.5481 1470.1009 1477.8945 1492.3916 1573.6925 1602.4992 1647.9546 2885.6758 2959.8271 3014.8921 3047.4184 3069.6418 3104.8428 3125.7860 3143.4266 3144.3308 3165.1619 3170.7810 3345.4961 3420.5744 3601.0056
redmass: 4.1532 2.6339 3.3665 2.6613 3.6165 2.7090 4.1140 3.8187 4.5844 1.2270 3.8780 4.1706 3.1930 2.8662 2.1703 1.5494 2.9289 2.9901 3.1232 2.6226 6.3598 7.0872 3.5009 2.5444 2.0936 5.9980 1.1267 1.3050 1.5494 1.3418 1.3496 1.7059 5.0548 3.5772 1.8241 3.5291 2.7853 1.3423 1.2610 2.7331 1.3339 1.2971 1.1962 3.5355 1.5325 1.2339 1.2195 1.2665 1.3279 5.0829 4.1625 1.1906 1.0995 1.1194 1.0500 1.3242 1.5803 1.0824 7.4539 6.4188 1.0858 1.0717 1.0330 1.0596 1.1039 1.0887 1.1056 1.0993 1.0883 1.0884 1.0957 1.0969 1.0746 1.0468 1.0974
irintensity: 1.0830 1.3729 2.3456 3.6203 2.5299 7.6931 5.5897 2.5031 1.1693 0.0125 4.9412 2.6735 18.2632 55.1335 87.6491 125.6422 1.4875 15.2626 3.5086 31.6253 17.1797 1.4731 34.7214 22.1813 53.9632 3.9192 4.4439 16.4376 62.1861 0.0723 0.3447 9.7981 31.0304 15.5004 1.8408 13.8609 2.2143 13.2172 0.2236 2.6088 0.7738 8.9516 63.2692 198.5801 4.1759 5.4349 2.4868 1.1887 0.9227 7.2068 2.8684 21.4255 3.7922 7.2536 14.0840 142.6474 32.1327 3.6658 14.1830 57.9610 3.4762 81.5649 68.5362 22.8644 49.1040 8.0678 24.0757 26.5809 2.0144 8.9210 14.9924 4.1725 17.5533 25.9564 3.8090
temp: 298.150 k
press: 1.00000 atm
elementType: 16 8 7 7 6 6 6 6 6 6 6 6 6 1 1 1 1 1 1 1 1 1 1 1 1 1 1
symmnumber: 1
zpe: 575043.8 jmol-1
zpe.correction: 0.219023 hartree
zpe.thermalcorrener: 0.233871 hartree
zpe.thermalcorrenthalpy: 0.234815 hartree
zpe.thermalcorrgfe: 0.173910 hartree
zpe.sumelectzpe: -933.073217 hartree
zpe.sumelectthermal: -933.058368 hartree
zpe.sumelectthermalent: -933.057424 hartree
zpe.sumelectthermalfe: -933.118329 hartree
dipole: 0.4800 -0.9460 -3.5095
dipole: 3.6664
quadrupole: -61.0303 -89.7339 -79.8174
quadrupole: 4.8892 0.8488 -2.5781
quadrupole: 15.8302 -12.8733 -2.9569 4.8892 0.8488 -2.5781
hfenergy: -933.2922392 hartree
pointgroup: C01 [X(C9H14N2O1S1)]
dipole: -0.1663186 1.4290867 0.1035859 debye
polarizability: 212.5322877|-12.7218383|100.1187943|-8.9451315|-11.3202561|103.4519851 unknown
InChI: InChI=1S/C9H14N2OS/c1-12-8-2-4-9(5-3-8)13-7-6-11-10/h2-5,11H,6-7,10H2,1H3
charge 0 multiplicity 1
27 atoms
S  1.428912 -0.663816 -1.376574
O  -4.167645 0.116816 0.854886
N  4.749747 0.73018 0.683177
N  6.132118 0.40174 0.679195
C  2.457676 0.19039 -0.014983
C  3.950792 -0.019173 -0.315075
C  -0.26278 -0.381623 -0.696846
C  -1.084331 0.629969 -1.239746
C  -0.766927 -1.205575 0.342161
C  -2.887789 0.01052 0.290076
C  -2.398821 0.832022 -0.756347
C  -2.068159 -1.009424 0.839133
C  -5.060279 1.147429 0.320094
H  2.183448 1.26076 -0.016212
H  2.190431 -0.252167 0.957408
H  4.220499 -1.083226 -0.212209
H  4.170372 0.279653 -1.369488
H  -0.697283 1.26087 -2.046669
H  -0.140188 -2.005071 0.751292
H  -3.016843 1.620087 -1.196921
H  -2.47303 -1.634925 1.640355
H  4.555985 1.744986 0.650486
H  6.741064 0.862958 -0.007007
H  6.526062 0.275654 1.611124
H  -4.637374 2.160852 0.46427
H  -5.991174 1.04889 0.897371
H  -5.268683 0.981824 -0.754949
