program: Gaussian 09
title: 000051009
version: EM64L-G09RevD.01
frameworkgroup: C1[X(C10H16N2O2)]
method: RPBEPBE
basis: SDD
operation: Freq
keyword: #p
keyword: freq=noraman
keyword: PBEPBE/SDD
title: #p freq=noraman PBEPBE/SDD
converged: YES YES NO NO
title: Mulliken charges:
elementType: O O N N C C C C C C C C C C H H H H H H H H H H H H H H H H
charge: -0.273479 -0.270234 -0.320134 -0.588615 -0.041151 -0.320934 -0.684232 0.352349 -0.343779 -0.360147 0.312580 -0.354817 -0.326933 -0.536877 0.202390 0.187338 0.220236 0.224178 0.243944 0.205292 0.239465 0.247036 0.250788 0.236671 0.250547 0.301287 0.268500 0.243233 0.218114 0.217385
chargesum: 0.00000
title: Mulliken charges with hydrogens summed into heavy atoms:
elementType: O O N N C C C C C C C C C C
charge: -0.273479 -0.270234 -0.080669 -0.018828 0.161238 0.086640 -0.010819 0.352349 -0.096743 -0.109359 0.312580 -0.118146 -0.076386 0.141855
polarizability: 2.00411984e+02 3.40053092e+00 1.21319197e+02 -2.14524877e+00 -5.79279927e+00 8.01583936e+01
1716.lowfreq: -6.2335 -2.8671 -0.0006 -0.0004 0.0003 4.7578 30.7581 43.9151 64.6467
frequency: 30.6118 43.9049 64.6440 86.7027 100.8866 127.0175 167.1549 187.9593 224.3293 234.4302 240.0794 261.6344 318.8667 338.6525 361.5671 365.9223 411.9801 418.9721 444.8864 512.5405 515.0455 516.4594 565.8033 630.0422 700.1407 713.8834 735.9501 790.5494 810.3753 828.7586 869.6601 902.8037 934.4902 951.6375 954.7318 987.0493 991.6157 1000.6752 1077.3130 1109.1616 1113.2425 1136.6960 1153.8604 1156.4155 1162.7101 1174.9764 1200.0394 1224.9421 1228.5825 1236.5932 1296.3776 1302.0162 1347.6082 1365.9594 1376.4545 1388.4469 1425.4692 1436.1950 1462.0096 1465.4922 1465.8018 1473.4913 1484.9975 1488.3465 1497.4242 1588.9133 1626.2750 1646.9876 2893.1518 2925.2650 2952.3802 2990.2478 3010.9143 3037.2201 3090.4086 3108.0118 3120.0524 3146.8774 3153.4234 3167.0912 3175.2299 3327.5872 3426.5875 3609.4406
redmass: 4.3483 3.0135 4.2154 3.3222 3.6334 2.6968 3.9823 2.4442 2.6842 1.4582 1.1880 3.3882 3.1054 1.1780 2.9016 1.7125 3.3354 3.2154 3.6257 2.8530 3.2862 2.4868 2.8143 6.8427 2.9814 3.5784 2.1882 1.3229 5.4393 1.5793 2.5499 1.3795 1.2527 2.0336 1.3559 6.4725 4.3809 3.1813 1.8694 1.2736 1.2605 1.6360 1.4417 1.8081 1.9882 1.2410 2.9120 1.3953 1.7796 5.4914 1.2889 1.2438 1.3796 1.6365 1.7801 1.9959 3.8654 1.1682 1.0531 1.0580 1.1116 1.0825 1.1220 1.1403 2.0752 7.7391 6.3974 1.0870 1.0821 1.0605 1.0333 1.0362 1.1005 1.1037 1.0987 1.1001 1.0988 1.0869 1.0878 1.0955 1.0975 1.0740 1.0471 1.0974
irintensity: 0.7033 1.3289 0.9216 3.1818 3.7232 2.8129 8.8753 2.0522 4.0838 2.2701 0.7752 3.3069 4.5588 111.4828 57.7822 120.2541 3.7981 0.3317 1.8510 6.6891 9.3471 14.0415 5.8562 0.1357 65.8490 0.0356 53.6588 23.6496 1.9549 75.7025 4.3649 0.3588 4.3088 0.6559 0.0381 37.8234 32.0344 99.8774 6.3255 16.4044 0.2549 8.8438 4.6425 4.9745 4.0758 5.5204 441.3218 4.7974 7.9263 8.2105 5.1952 3.0039 6.7121 4.1238 29.3524 11.0507 3.6872 22.8390 23.5509 21.3327 66.1345 54.2021 30.3180 0.2188 223.3783 8.9654 2.5463 6.3153 62.2782 52.5140 71.5350 18.7962 48.0924 55.6402 33.4260 21.5754 28.9010 18.9428 4.6115 13.7287 3.1667 26.1070 16.2779 4.7855
temp: 298.150 k
press: 1.00000 atm
elementType: 8 8 7 7 6 6 6 6 6 6 6 6 6 6 1 1 1 1 1 1 1 1 1 1 1 1 1 1 1 1
symmnumber: 1
zpe: 655488.4 jmol-1
zpe.correction: 0.249662 hartree
zpe.thermalcorrener: 0.264945 hartree
zpe.thermalcorrenthalpy: 0.265889 hartree
zpe.thermalcorrgfe: 0.206595 hartree
zpe.sumelectzpe: -649.451453 hartree
zpe.sumelectthermal: -649.436171 hartree
zpe.sumelectthermalent: -649.435226 hartree
zpe.sumelectthermalfe: -649.494520 hartree
dipole: 0.8672 -3.2434 -1.0094
dipole: 3.5058
quadrupole: -68.6721 -78.4152 -85.5502
quadrupole: 2.7100 -8.9393 -0.1164
quadrupole: 8.8737 -0.8694 -8.0044 2.7100 -8.9393 -0.1164
hfenergy: -649.7011154 hartree
pointgroup: C01 [X(C10H16N2O2)]
dipole: -0.3368347 1.3018755 -0.3066885 debye
polarizability: 200.131484|3.2477826|120.1912332|5.9966491|9.0391368|81.5668575 unknown
InChI: InChI=1S/C10H16N2O2/c1-8(12-11)7-14-10-5-3-9(13-2)4-6-10/h3-6,8,12H,7,11H2,1-2H3
charge 0 multiplicity 1
30 atoms
O  -1.024238 -0.653791 -0.369984
O  4.563988 -0.033158 0.04011
N  -4.290763 1.066011 -0.331635
N  -5.661543 0.748001 -0.509847
C  -3.378249 -0.11462 -0.288624
C  -1.958374 0.448121 -0.10642
C  -3.766738 -1.067542 0.850498
C  0.350797 -0.384789 -0.234546
C  0.897408 0.864774 0.134641
C  1.213599 -1.480257 -0.500911
C  3.157321 -0.071499 -0.028823
C  2.302928 1.021717 0.238055
C  2.603734 -1.325515 -0.399141
C  5.178491 1.237734 0.421317
H  -3.389542 -0.683956 -1.249875
H  -1.763845 1.276829 -0.824494
H  -1.829094 0.831298 0.925785
H  -3.078204 -1.930008 0.87451
H  -4.799089 -1.424778 0.702453
H  -3.718388 -0.540236 1.821081
H  -3.946526 1.780457 -0.996149
H  0.253748 1.723294 0.347832
H  0.771594 -2.440208 -0.784503
H  2.704546 1.997721 0.526702
H  3.282126 -2.159875 -0.600863
H  -6.29183 1.256857 0.108046
H  -6.003834 0.567751 -1.460492
H  6.262271 1.048675 0.414109
H  4.862653 1.551898 1.435993
H  4.935851 2.038594 -0.305225
