program: Orca
programVersion: 5.0.3
elementType: C H C H C C C H H C H H C C H H H H H H H
charge: 1
multiplicity: 1
keywords: PBE0 cc-pVTZ EnGrad RIJCOSX verytightscf cc-pVTZ/C def2/J soscf
formula: C8H13
InChI: InChI=1/C8H13/c1-2-4-6-8-7-5-3-1/h1-2,7H,3-6,8H2
21 atoms
C  -1.995221 0.537615 0.118954
H  -2.171306 0.726678 1.181607
C  -1.931618 -0.989711 -0.1731
H  -2.67332 -1.574543 0.374354
C  -0.503093 -1.177802 0.293083
C  0.617421 -1.148855 -0.494371
C  1.910879 -0.661294 0.068492
H  2.0208 -0.951276 1.118854
H  2.772209 -1.042598 -0.487237
C  1.877982 0.901107 -0.0480
H  1.981933 1.184825 -1.102089
H  2.72902 1.334438 0.484306
C  0.546851 1.480223 0.497311
C  -0.573104 0.895092 -0.277865
H  0.533382 -1.307423 -1.56921
H  -2.03409 -1.191814 -1.243662
H  0.423874 1.328138 1.574178
H  -0.438927 0.962746 -1.360449
H  -2.740441 1.07935 -0.473624
H  0.553423 2.569211 0.317208
H  -0.356299 -1.130963 1.373666
totalener: -312.07620682 hartree
nucrepener: 384.25037793 hartree
electener: -696.32658475 hartree
oneelecener: -1169.38270355 hartree
twoeener: 473.05611880 hartree
kineticenergy: 309.64745105 hartree
exchangeener: -34.164543993863 hartree
correlationener: -1.970845097583 hartree
xcener: -36.135389091446 hartree
chargesum: 1.0000000
charge: -0.158787 0.145848 -0.166173 0.154610 -0.062543 -0.077255 -0.180997 0.140789 0.155867 -0.199747 0.138663 0.153358 -0.165279 -0.041654 0.191550 0.142665 0.143900 0.185582 0.155846 0.174279 0.169478
charge: 0.090973 0.001711 0.095314 -0.000040 0.122800 0.137293 0.078249 0.001940 0.007528 0.098706 -0.004679 0.000761 0.065058 0.259590 -0.002444 0.001185 0.001686 0.005075 0.004580 0.030495 0.004219
qa: -0.1588 0.1458 -0.1662 0.1546 -0.0625 -0.0773 -0.1810 0.1408 0.1559 -0.1997 0.1387 0.1534 -0.1653 -0.0417 0.1916 0.1427 0.1439 0.1856 0.1558 0.1743 0.1695
va: 3.8519 0.9942 3.8707 0.9877 3.8063 3.8042 3.8988 0.9934 0.9879 3.8741 0.9895 0.9853 3.8765 3.7041 0.9782 0.9959 0.9926 0.9838 0.9861 0.9793 0.9921
energy: -312.076206824720
dipole: 0.56251 -0.76660 -0.20409 1.85977 -1.56694 0.29283 0.17592 -0.31226 -0.13634
magnitude: 0.38208 au
magnitude: 0.97118 debye
