program: Gaussian 09
title: 000051047
version: EM64L-G09RevD.01
frameworkgroup: C1[X(C15H17ClN2O2)]
method: RPBEPBE
basis: SDD
operation: Freq
keyword: #p
keyword: freq=noraman
keyword: PBEPBE/SDD
title: #p freq=noraman PBEPBE/SDD
converged: YES YES NO NO
title: Mulliken charges:
elementType: Cl O O N N C C C C C C C C C C C C C C C H H H H H H H H H H H H H H H H H
charge: -0.068067 -0.248724 -0.250343 -0.342768 -0.048152 -0.142908 0.238769 -0.320469 -0.482457 -0.506055 -0.521027 -0.370900 0.413590 0.120140 0.162458 -0.622163 -0.403239 -0.373443 -0.127961 -0.206896 0.281377 0.251886 0.221193 0.206964 0.249725 0.214936 0.267653 0.251093 0.193802 0.221298 0.317210 0.192874 0.227764 0.227528 0.260804 0.256664 0.257841
chargesum: 0.00000
title: Mulliken charges with hydrogens summed into heavy atoms:
elementType: Cl O O N N C C C C C C C C C C C C C C C
charge: -0.068067 -0.248724 -0.250343 -0.025558 -0.048152 0.138469 0.238769 -0.068582 -0.054299 -0.041393 -0.002281 0.044200 0.413590 0.120140 0.162458 0.026002 -0.142434 -0.116779 -0.127961 0.050945
polarizability: 2.46495802e+02 -1.86423079e+00 1.56282234e+02 6.31598361e+00 -1.73443033e+01 1.48260968e+02
1716.lowfreq: -3.2714 -0.0019 -0.0012 0.0004 0.7283 11.6982 41.6651 65.1037 82.8158
frequency: 41.5865 65.0790 82.7893 129.2897 139.7246 146.2581 166.6418 214.6084 225.7219 242.0207 254.9287 280.9998 306.6166 332.0888 339.9785 365.4328 373.8591 381.9397 411.8085 449.2906 472.4347 481.5171 498.3414 504.3634 531.6895 551.9240 572.7315 591.9508 637.8950 671.6813 693.1854 712.7645 729.4707 747.1269 770.0631 814.5089 818.4726 826.7861 867.8479 877.2098 886.2173 922.9057 945.8733 953.9239 970.9916 977.5367 1017.7990 1031.1357 1064.4149 1069.3649 1084.6061 1097.4420 1104.9219 1122.4545 1128.7730 1154.6848 1163.9143 1175.0226 1183.2966 1196.0346 1211.3966 1216.2296 1244.4233 1254.9415 1282.4115 1290.8516 1305.2321 1310.1953 1327.1893 1331.8987 1342.2620 1350.4696 1361.5386 1376.3638 1381.2342 1407.7048 1425.1449 1435.5568 1446.4026 1460.3152 1463.0689 1463.9694 1466.2109 1479.4118 1484.2979 1578.4410 1609.2340 1629.1321 2849.3636 2856.4601 2873.6481 2998.1263 3008.4203 3011.1117 3016.5131 3023.7247 3035.5739 3039.9886 3072.7837 3081.4455 3086.5923 3144.2091 3159.4524 3179.5323 3497.6158
redmass: 8.2188 7.3788 4.3830 4.7940 4.8780 3.5172 3.1168 3.9498 3.4594 1.3418 3.2780 3.9709 3.1267 3.6392 2.6867 2.3335 6.1487 5.1566 6.8114 3.9156 3.2537 3.3240 3.8641 3.4524 2.4675 4.4558 4.5567 3.7006 6.8479 4.7506 4.1850 1.6750 3.7589 4.4999 2.6199 2.8159 1.4981 3.5914 3.5964 1.9311 2.2668 2.6800 1.3530 2.6245 2.3290 2.3885 2.1410 1.8760 1.8103 2.1828 2.1435 1.7532 1.7411 2.2156 1.6986 1.8064 1.6835 2.4165 1.5829 1.3919 1.7603 2.2464 2.2870 1.6404 1.5608 1.5212 1.8242 1.6359 1.5950 1.4863 2.3436 1.5271 1.4734 7.7024 1.4358 3.8821 1.6911 1.1748 1.1241 1.1798 1.3950 1.5766 1.0658 1.0994 1.0541 7.7473 7.8383 6.1689 1.0710 1.0661 1.0592 1.0732 1.0640 1.0762 1.0869 1.0739 1.0865 1.0885 1.0966 1.1011 1.0993 1.0924 1.0884 1.0976 1.0757
irintensity: 0.1942 3.1287 0.7951 0.2474 0.1527 0.4767 0.8691 2.0872 4.7713 0.9032 1.7953 1.5827 2.9577 1.8056 2.1053 2.0353 8.5809 4.4201 2.6061 2.0196 3.5196 12.7349 2.0770 6.3815 10.8823 7.5511 2.4654 10.5960 24.5978 16.7011 9.4676 79.9961 0.7458 11.6913 14.1205 38.3448 50.5370 12.2172 2.8226 84.7507 78.7478 70.1998 0.7092 14.7722 11.4168 17.7345 41.1266 32.5355 17.9317 10.2368 12.4952 27.9890 31.7269 29.0092 25.3101 24.5280 0.9586 34.9918 34.5401 27.6939 19.8771 25.1394 15.2204 13.7607 13.6620 3.7879 51.3280 30.1032 3.2677 8.2697 59.7459 15.8233 14.2274 6.3813 10.0641 37.3817 28.1933 2.1659 27.2868 18.8637 71.6531 77.0785 19.8694 10.0055 9.8632 4.0672 1.6919 343.4991 45.6852 55.0887 190.8134 12.3228 18.0551 30.5744 20.3492 44.0428 22.6004 41.5448 10.2770 30.0093 18.1518 2.0154 1.7585 3.4260 17.7357
temp: 298.150 k
press: 1.00000 atm
elementType: 17 8 8 7 7 6 6 6 6 6 6 6 6 6 6 6 6 6 6 6 1 1 1 1 1 1 1 1 1 1 1 1 1 1 1 1 1
symmnumber: 1
zpe: 780228.6 jmol-1
zpe.correction: 0.297173 hartree
zpe.thermalcorrener: 0.313877 hartree
zpe.thermalcorrenthalpy: 0.314821 hartree
zpe.thermalcorrgfe: 0.253581 hartree
zpe.sumelectzpe: -1300.350462 hartree
zpe.sumelectthermal: -1300.333759 hartree
zpe.sumelectthermalent: -1300.332815 hartree
zpe.sumelectthermalfe: -1300.394054 hartree
dipole: 4.0498 -2.1306 -2.1209
dipole: 5.0437
quadrupole: -122.7740 -135.3147 -124.0162
quadrupole: -0.4903 -4.1782 -15.2571
quadrupole: 4.5943 -7.9463 3.3521 -0.4903 -4.1782 -15.2571
hfenergy: -1300.6476353 hartree
pointgroup: C01 [X(C15H17Cl1N2O2)]
dipole: -1.3937745 1.3503891 -0.414033 debye
polarizability: 243.7358557|-16.1277313|145.0307123|-5.1436252|15.9291544|162.2724361 unknown
InChI: InChI=1S/C15H17ClN2O2/c1-18-5-4-15-12(8-18)10(7-14(19)17-15)11-6-9(16)2-3-13(11)20-15/h2-3,6,10,12,17H,4-5,7-8H2,1H3
charge 0 multiplicity 1
37 atoms
Cl 5.50645 -0.721481 -1.063971
O  0.268822 0.833526 1.487309
O  -1.175362 -3.24246 0.633812
N  -1.298152 -0.967872 1.045315
N  -3.185217 1.616976 -0.767481
C  -0.874923 0.711889 -0.717176
C  -1.017235 0.444026 0.795998
C  0.176231 -0.286649 -1.260443
C  -2.250749 0.667941 -1.416636
C  -2.081336 1.342695 1.438675
C  -0.335759 -1.747297 -1.118474
C  -3.407576 1.26681 0.656277
C  1.477131 -0.092164 -0.479505
C  -0.948085 -2.060274 0.24797
C  1.456204 0.436474 0.840929
C  -4.447929 1.762258 -1.518363
C  2.725475 -0.443783 -1.045021
C  2.653371 0.616177 1.571101
C  3.907481 -0.264224 -0.307278
C  3.892298 0.266074 0.998445
H  -0.493302 1.745183 -0.814866
H  0.367372 -0.082942 -2.331092
H  -2.124414 0.968403 -2.474093
H  -2.663518 -0.372719 -1.411152
H  -1.703617 2.37861 1.421237
H  -2.231675 1.052869 2.496255
H  0.482099 -2.470395 -1.279404
H  -1.106893 -1.973099 -1.880066
H  -3.85572 0.245154 0.763949
H  -4.124767 1.9890 1.08648
H  -1.65942 -1.214562 1.972888
H  -5.039708 0.814619 -1.582308
H  -4.231582 2.099948 -2.547531
H  -5.080162 2.527867 -1.034856
H  2.767854 -0.847396 -2.062507
H  2.599694 1.026391 2.583681
H  4.822718 0.400124 1.556899
