program: Gaussian 09
title: 000051007
version: EM64L-G09RevD.01
frameworkgroup: C1[X(C9H14N2O2)]
method: RPBEPBE
basis: SDD
operation: Freq
keyword: #p
keyword: freq=noraman
keyword: PBEPBE/SDD
title: #p freq=noraman PBEPBE/SDD
converged: YES YES NO NO
title: Mulliken charges:
elementType: O O N N C C C C C C C C C H H H H H H H H H H H H H H
charge: -0.276048 -0.277665 -0.301502 -0.577558 -0.279081 -0.368214 0.390481 -0.487685 0.348439 -0.406239 -0.392449 -0.183843 -0.535884 0.190683 0.230434 0.246719 0.200252 0.270443 0.249808 0.240303 0.221893 0.246185 0.266745 0.300193 0.242436 0.220933 0.220222
chargesum: 0.00000
title: Mulliken charges with hydrogens summed into heavy atoms:
elementType: O O N N C C C C C C C C C
charge: -0.276048 -0.277665 -0.055317 -0.010620 0.142036 0.078756 0.390481 -0.217242 0.348439 -0.156430 -0.152146 0.038050 0.147706
polarizability: 1.75241993e+02 4.60758149e+00 1.23470735e+02 -1.38696382e+00 6.05398247e-01 6.76158990e+01
1716.lowfreq: -0.0010 -0.0008 -0.0006 2.7800 8.8332 13.5304 36.0252 57.6691 73.8276
frequency: 36.0082 57.6560 73.8238 81.8295 102.1036 142.5275 188.3155 202.1480 237.5127 241.7756 264.2045 286.2802 349.5885 392.9751 427.7041 453.4998 472.0163 510.0852 543.3099 583.3246 605.6307 684.5457 705.3589 726.2287 767.4622 830.4094 854.3100 857.2579 881.9372 956.8279 972.9407 985.9911 1019.2994 1024.0368 1080.4950 1088.9786 1112.9363 1126.1687 1145.6696 1155.6380 1162.5540 1184.4624 1186.9315 1240.5541 1254.8184 1267.0786 1291.1452 1318.3180 1385.7738 1401.2761 1432.8399 1443.4994 1465.7517 1470.8689 1474.3018 1476.2723 1484.6352 1494.1567 1592.7952 1615.7964 1651.1530 2913.1576 2947.3046 2957.5465 3028.2968 3044.2118 3088.2371 3122.0938 3135.9364 3168.0261 3176.1535 3178.8172 3349.1315 3421.5781 3598.4286
redmass: 3.9268 3.9530 2.3852 3.0677 3.0481 2.4599 3.3823 1.6004 5.6463 3.9890 1.8486 3.7293 2.0058 1.5445 1.8566 2.9527 2.7883 4.3636 4.9430 5.1646 4.7358 1.9315 2.5263 2.0828 1.3901 1.2582 1.4265 1.5225 5.6082 1.3046 6.4587 6.7118 2.5108 3.0753 1.7073 2.4275 1.2598 1.7871 1.8047 1.3293 2.1544 1.3458 1.2188 1.6418 4.6647 1.1733 1.3274 1.2747 1.6788 4.4857 1.4460 2.0613 1.0500 1.2935 1.1391 1.2188 1.4263 1.1257 6.7496 6.5841 1.0861 1.0713 1.0605 1.0329 1.1004 1.1038 1.0918 1.0993 1.0874 1.0917 1.0931 1.0957 1.0744 1.0467 1.0976
irintensity: 3.2156 0.6492 7.3896 5.0521 4.1997 7.5807 0.5086 0.0643 1.2478 5.2571 0.0424 5.8457 40.3560 136.0374 101.5948 4.6487 27.6376 5.3381 16.5134 8.1280 0.0064 27.1737 29.2016 65.4923 51.7770 23.2962 0.0112 34.5643 9.2399 1.1495 12.4629 28.9641 28.6915 100.7494 10.6668 6.9591 0.2570 0.6644 187.2339 64.6998 6.6695 58.7754 17.8499 2.4167 106.8013 1.6758 9.5231 2.9535 20.0093 6.9142 16.5440 21.8307 12.6388 83.6619 53.6695 11.1318 36.3027 1.7760 98.0032 225.5312 6.1827 73.7515 42.6596 69.0821 33.3114 51.3963 22.5700 26.0990 12.5197 12.5747 9.7264 2.0577 19.6854 23.0808 3.3284
temp: 298.150 k
press: 1.00000 atm
elementType: 8 8 7 7 6 6 6 6 6 6 6 6 6 1 1 1 1 1 1 1 1 1 1 1 1 1 1
symmnumber: 1
zpe: 584092.9 jmol-1
zpe.correction: 0.222469 hartree
zpe.thermalcorrener: 0.236370 hartree
zpe.thermalcorrenthalpy: 0.237314 hartree
zpe.thermalcorrgfe: 0.180928 hartree
zpe.sumelectzpe: -610.226700 hartree
zpe.sumelectthermal: -610.212799 hartree
zpe.sumelectthermalent: -610.211855 hartree
zpe.sumelectthermalfe: -610.268242 hartree
dipole: -0.1157 -1.3394 1.4702
dipole: 1.9922
quadrupole: -48.5481 -76.2395 -79.9211
quadrupole: -3.6563 7.3248 -0.6299
quadrupole: 19.6882 -8.0032 -11.6849 -3.6563 7.3248 -0.6299
hfenergy: -610.4491695 hartree
pointgroup: C01 [X(C9H14N2O2)]
dipole: -0.0563844 -0.542169 0.5632177 debye
polarizability: 175.2942479|4.3877581|123.3584297|0.3744365|2.183276|67.6759493 unknown
InChI: InChI=1S/C9H14N2O2/c1-12-8-3-2-4-9(7-8)13-6-5-11-10/h2-4,7,11H,5-6,10H2,1H3
charge 0 multiplicity 1
27 atoms
O  1.158647 0.982852 0.186679
O  -2.848817 -1.758142 0.033333
N  4.317795 -0.961259 0.321819
N  5.676948 -0.728917 -0.01767
C  1.984785 -0.234909 0.162954
C  3.44676 0.228119 0.193033
C  -0.235097 0.827594 0.151513
C  -0.887776 -0.422957 0.106165
C  -2.304922 -0.461994 0.076961
C  -0.983257 2.035196 0.167642
C  -3.070081 0.727849 0.092306
C  -2.386389 1.968998 0.13759
C  -4.30716 -1.875429 -0.006298
H  1.745283 -0.864271 1.047699
H  1.786408 -0.822947 -0.753926
H  3.708932 0.723859 -0.754949
H  3.574012 0.97599 1.010497
H  -0.346583 -1.372167 0.088798
H  -0.449595 2.988915 0.202083
H  -4.162811 0.707039 0.069714
H  -2.967312 2.89807 0.149418
H  4.185044 -1.44954 1.222774
H  6.295856 -0.335316 0.700862
H  6.08329 -1.460727 -0.600171
H  -4.507961 -2.956462 -0.041211
H  -4.727003 -1.388458 -0.908208
H  -4.772093 -1.438487 0.89919
