program: Orca
programVersion: 5.0.3
elementType: C H C H C C C H H C H H C C H H H H H H H
charge: 1
multiplicity: 1
keywords: PBE0 def2-TZVP EnGrad D3BJ RIJCOSX verytightscf def2/J soscf
formula: C8H13
InChI: InChI=1/C8H13/c1-2-4-6-8-7-5-3-1/h1-2,7H,3-6,8H2
21 atoms
C  -1.99778 0.528988 0.119815
H  -2.175937 0.722721 1.181077
C  -1.958015 -0.998063 -0.169806
H  -2.676103 -1.59163 0.398134
C  -0.519346 -1.136076 0.281257
C  0.609477 -1.120939 -0.504701
C  1.906967 -0.650818 0.064379
H  2.006436 -0.952499 1.112471
H  2.761274 -1.04496 -0.492599
C  1.896647 0.914378 -0.034582
H  2.024853 1.208304 -1.082965
H  2.743524 1.32684 0.520124
C  0.558315 1.481307 0.489557
C  -0.546097 0.81815 -0.262587
H  0.530192 -1.299242 -1.576661
H  -2.074265 -1.208557 -1.237012
H  0.442459 1.361496 1.57165
H  -0.421125 0.881866 -1.346495
H  -2.713954 1.099968 -0.479528
H  0.521039 2.560947 0.272778
H  -0.369002 -1.08506 1.360873
totalener: -312.08584017 hartree
nucrepener: 385.59551521 hartree
electener: -697.68135537 hartree
oneelecener: -1172.07229513 hartree
twoeener: 474.39093976 hartree
kineticenergy: 310.17776104 hartree
exchangeener: -34.189962280835 hartree
correlationener: -1.974591125883 hartree
xcener: -36.164553406718 hartree
chargesum: 1.0000000
charge: -0.190552 0.162553 -0.194007 0.176961 -0.060477 -0.059543 -0.222033 0.161649 0.177307 -0.242561 0.157009 0.176092 -0.183458 -0.081209 0.196000 0.158850 0.151060 0.182021 0.176063 0.185411 0.172862
charge: -0.200068 0.158631 -0.193511 0.155350 -0.061762 -0.035266 -0.212631 0.160945 0.164410 -0.213676 0.153448 0.157197 -0.230618 0.021010 0.168239 0.158089 0.157819 0.175340 0.158000 0.183574 0.175481
qa: -0.1906 0.1626 -0.1940 0.1770 -0.0605 -0.0595 -0.2220 0.1616 0.1773 -0.2426 0.1570 0.1761 -0.1835 -0.0812 0.1960 0.1589 0.1511 0.1820 0.1761 0.1854 0.1729
va: 3.9255 0.9749 3.9214 0.9706 3.9220 3.8774 3.9610 0.9676 0.9681 3.9446 0.9697 0.9646 3.9632 3.8776 0.9497 0.9740 0.9735 0.9557 0.9693 0.9638 0.9624
dispcorr: -0.018193101 hartree
energy: -312.104033266708
dipole: 0.56170 -0.71269 -0.15099 1.85360 -1.73544 0.11815 0.18900 -0.33902 -0.15001
magnitude: 0.24344 au
magnitude: 0.61877 debye
