program: Orca
programVersion: 5.0.3
elementType: C H C H C C C H H C H H C C H H H H H H H
charge: 1
multiplicity: 1
keywords: m062x def2-TZVP EnGrad RIJCOSX verytightscf def2/J soscf
formula: C8H13
InChI: InChI=1/C8H13/c1-2-4-6-8-7-5-3-1/h1-2,7H,3-6,8H2
21 atoms
C  -2.00118 0.75511 0.069179
H  -2.163172 0.81911 1.147818
C  -1.730073 -0.973257 -0.162881
H  -2.618976 -1.328141 0.36287
C  -0.412901 -1.387169 0.389835
C  0.683431 -1.272793 -0.38345
C  1.998516 -0.696317 0.062614
H  2.203862 -0.900836 1.118857
H  2.854354 -1.036047 -0.527094
C  1.787734 0.846095 -0.13587
H  1.823372 1.10961 -1.198734
H  2.591938 1.396736 0.359276
C  0.423757 1.27787 0.494742
C  -0.766865 1.294418 -0.364447
H  0.518349 -1.193878 -1.462709
H  -1.830568 -1.132495 -1.237054
H  0.208968 0.687276 1.389177
H  -0.659236 1.623987 -1.401574
H  -2.882936 0.997013 -0.522556
H  0.495739 2.323581 0.866332
H  -0.328891 -1.478056 1.472022
totalener: -312.27180174 hartree
nucrepener: 379.26048563 hartree
electener: -691.53228737 hartree
oneelecener: -1159.35321866 hartree
twoeener: 467.82093129 hartree
kineticenergy: 310.39829427 hartree
xcener: -23.089743730117 hartree
chargesum: 1.0000000
charge: -0.363387 0.238932 -0.273298 0.215377 -0.196953 -0.101033 -0.335388 0.199170 0.194656 -0.320935 0.198275 0.196036 -0.262802 0.134662 0.172527 0.221265 0.190088 0.234108 0.216128 0.243321 0.199252
charge: -0.166759 0.174720 -0.116789 0.163158 -0.185799 -0.124465 -0.225891 0.154872 0.154391 -0.209341 0.149408 0.156636 -0.212870 0.104886 0.156339 0.157696 0.171518 0.175737 0.162766 0.206493 0.153297
qa: -0.3634 0.2389 -0.2733 0.2154 -0.1970 -0.1010 -0.3354 0.1992 0.1947 -0.3209 0.1983 0.1960 -0.2628 0.1347 0.1725 0.2213 0.1901 0.2341 0.2161 0.2433 0.1993
va: 3.7782 0.9333 3.6974 0.9480 3.6578 3.6574 3.7482 0.9494 0.9622 3.7304 0.9469 0.9568 3.6933 3.4085 0.9555 0.9394 0.9666 0.9370 0.9574 0.9320 0.9526
energy: -312.271801737579
dipole: 0.19927 -1.07122 -0.87194 1.76794 -0.59352 1.17441 0.34331 -0.48174 -0.13843
magnitude: 1.46925 au
magnitude: 3.73453 debye
