program: Orca
programVersion: 5.0.3
elementType: C H C H C C C H H C H H C C H H H H H H H
charge: 1
multiplicity: 1
keywords: DSD-PBEP86 def2-TZVP D3BJ RIJCOSX verytightscf def2-TZVP/C def2/J soscf noTRAH
formula: C8H13
InChI: InChI=1/C8H13/c1-2-4-6-8-7-5-3-1/h1-2,7H,3-6,8H2
21 atoms
C  -1.997358 0.748845 0.074373
H  -2.179187 0.853911 1.147174
C  -1.740002 -0.948079 -0.150024
H  -2.618464 -1.325742 0.378413
C  -0.424029 -1.376292 0.399808
C  0.691601 -1.282706 -0.36915
C  2.005276 -0.687879 0.06563
H  2.216939 -0.878799 1.123463
H  2.857968 -1.028875 -0.52666
C  1.795328 0.880626 -0.144948
H  1.84921 1.128873 -1.210273
H  2.603303 1.419832 0.355117
C  0.422018 1.252866 0.466634
C  -0.761884 1.314125 -0.379276
H  0.527988 -1.212844 -1.449184
H  -1.841348 -1.122382 -1.222042
H  0.143413 0.388326 1.084093
H  -0.643736 1.472236 -1.454969
H  -2.87569 0.984298 -0.52623
H  0.413227 2.015991 1.266559
H  -0.344156 -1.505767 1.480115
totalener: -311.08768689 hartree
nucrepener: 380.22252845 hartree
electener: -691.31021534 hartree
oneelecener: -1160.79943676 hartree
twoeener: 469.48922142 hartree
kineticenergy: 310.00397671 hartree
exchangeener: -13.664801743663 hartree
correlationener: -0.922832113558 hartree
xcener: -14.587633857221 hartree
chargesum: 1.0000000
charge: -0.252958 0.193733 -0.222360 0.193072 -0.183843 -0.121507 -0.208627 0.156607 0.166080 -0.292375 0.156670 0.170252 -0.113144 0.094028 0.142071 0.183620 0.127635 0.207229 0.195271 0.228901 0.179646
charge: -0.169465 0.165214 -0.130593 0.159347 -0.198734 -0.116046 -0.210847 0.147921 0.147272 -0.200435 0.141545 0.150319 -0.215849 0.151847 0.150697 0.152739 0.202240 0.172745 0.159206 0.191040 0.149840
qa: -0.2530 0.1937 -0.2224 0.1931 -0.1838 -0.1215 -0.2086 0.1566 0.1661 -0.2924 0.1567 0.1703 -0.1131 0.0940 0.1421 0.1836 0.1276 0.2072 0.1953 0.2289 0.1796
va: 3.8516 0.9621 3.8733 0.9566 3.8014 3.8845 3.8550 0.9715 0.9739 3.9185 0.9676 0.9707 3.6832 3.5860 0.9675 0.9606 1.0360 0.9469 0.9641 0.9404 0.9605
total: -311.764069271 hartree
dispcorr: -0.011987100 hartree
energy: -311.776056371317
dipole: 0.10252 -0.96459 -0.86207 1.11381 0.01787 1.13168 0.41744 -0.55153 -0.13409
magnitude: 1.42893 au
magnitude: 3.63206 debye
