program: Gaussian 09
title: 000006916
version: EM64L-G09RevD.01
frameworkgroup: C1[X(C5H10ClNO)]
method: RPBEPBE
basis: SDD
operation: Freq
keyword: #p
keyword: freq=noraman
keyword: PBEPBE/SDD
title: #p freq=noraman PBEPBE/SDD
converged: NO YES NO NO
title: Mulliken charges:
elementType: Cl O N C C C C C H H H H H H H H H H
charge: -0.130052 -0.175113 -0.046558 -0.355359 -0.353350 -0.643098 -0.635436 0.025786 0.219782 0.256186 0.219012 0.254296 0.249931 0.212928 0.223228 0.244558 0.211599 0.221660
chargesum: 0.00000
title: Mulliken charges with hydrogens summed into heavy atoms:
elementType: Cl O N C C C C C
charge: -0.130052 -0.175113 -0.046558 0.120608 0.119958 0.042990 0.042381 0.025786
polarizability: 9.00257570e+01 1.15972533e+00 7.80310777e+01 4.29827053e+00 4.87722627e+00 5.44692778e+01
1716.lowfreq: -13.0607 -7.6295 0.0029 0.0032 0.0033 12.2407 47.5411 75.5261 77.6120
frequency: 47.0377 75.5056 77.5912 130.4835 207.8453 214.1710 273.0089 308.9249 336.1092 385.5897 441.1649 492.5775 615.1204 627.4824 770.3531 781.9943 817.9014 941.2406 1001.4859 1070.9157 1081.0877 1094.7828 1110.4634 1195.6694 1238.9365 1294.7070 1341.8875 1355.8304 1377.8588 1390.4119 1392.6015 1461.0768 1467.7645 1469.5455 1479.1527 1482.7607 1485.9531 1735.9736 2990.0932 2990.2167 3014.8340 3020.1948 3075.7945 3079.2112 3090.0257 3095.1034 3106.2163 3108.4738
redmass: 2.6624 2.8855 6.3838 3.5134 1.1605 1.1367 2.7308 2.8047 4.0512 5.5732 2.9487 3.4596 9.4251 4.0978 1.6498 1.1409 1.7862 2.1012 2.5698 2.0838 1.9336 1.9637 1.8963 2.9039 1.6796 1.2254 1.2600 1.2827 1.8938 1.2136 1.2163 1.0618 1.0452 1.0465 1.0623 1.0641 1.0838 11.1072 1.0358 1.0358 1.0647 1.0621 1.1017 1.0992 1.0997 1.0974 1.1028 1.1024
irintensity: 1.4850 0.6346 0.2639 0.0639 0.4518 0.7755 1.2072 11.4718 28.6932 3.5477 2.4644 7.2706 14.9321 28.6180 11.6028 4.6744 74.4237 6.5833 8.3618 52.6390 4.0859 37.0877 66.8844 72.4499 61.0071 14.4932 2.9661 10.8152 74.7053 0.9923 36.7269 17.5613 8.2576 12.0945 7.0946 21.2640 11.1494 408.2572 20.5317 20.7757 31.2317 24.2367 6.0410 8.3409 34.7986 27.2674 14.8122 33.0631
temp: 298.150 k
press: 1.00000 atm
elementType: 17 8 7 6 6 6 6 6 1 1 1 1 1 1 1 1 1 1
symmnumber: 1
zpe: 386651.8 jmol-1
zpe.correction: 0.147268 hartree
zpe.thermalcorrener: 0.157182 hartree
zpe.thermalcorrenthalpy: 0.158126 hartree
zpe.thermalcorrgfe: 0.111185 hartree
zpe.sumelectzpe: -785.927735 hartree
zpe.sumelectthermal: -785.917821 hartree
zpe.sumelectthermalent: -785.916877 hartree
zpe.sumelectthermalfe: -785.963818 hartree
dipole: -3.5428 3.9550 0.6275
dipole: 5.3468
quadrupole: -55.3408 -59.5541 -55.8612
quadrupole: 2.1526 0.3806 -1.3266
quadrupole: 1.5779 -2.6355 1.0575 2.1526 0.3806 -1.3266
hfenergy: -786.0750029 hartree
pointgroup: C01 [X(C5H10Cl1N1O1)]
dipole: -1.3415825 -1.6172809 -0.0980454 debye
dipolederiv: -0.9543194 0.1126413 0.2453309 0.143347 -0.2709036 -0.0597986 0.2829141 -0.0538046 -0.2560409 -0.6294106 0.1509952 0.1412546 0.0929299 -1.1888652 -0.2732434 0.1281976 -0.327639 -0.3999028 -1.0412643 -0.2841253 -0.002503 -0.2210282 -0.9439068 -0.0019911 0.0631983 -0.0212608 -0.3475543 0.6688957 -0.0238477 -0.0044114 -0.1309234 0.1464123 -0.0247114 -0.0925941 -0.1029092 0.2318794 0.1519527 -0.1296999 0.0412963 -0.0805128 0.5929482 -0.004824 0.0933106 0.0810795 0.2287539 -0.0844163 0.0144042 -0.0431524 0.0418377 0.0349959 0.0441626 -0.0498457 0.0829601 -0.0243392 0.0311121 0.0455246 -0.0466318 0.0251614 -0.0660614 0.0422245 -0.0929788 0.0502001 -0.0263879 1.8485437 0.1940707 -0.4188534 0.1939183 1.681337 0.3727276 -0.4184011 0.3685199 0.4272923 -0.0153718 -0.0304634 0.0038187 -0.0395663 -0.0944468 0.1171101 0.0113027 0.0818208 0.0490262 0.0335103 -0.0122688 -0.0460737 0.0543893 0.0300056 -0.1115544 -0.0037496 -0.0474036 -0.0222954 -0.0861523 -0.0609716 -0.1272334 -0.0477508 -0.0088486 -0.0168999 -0.0830496 -0.0170101 0.0432548 0.034722 0.0560407 0.106879 0.0057269 0.0385569 0.0590519 0.0522192 0.0171911 -0.0102785 0.0892868 -0.0773965 0.0168809 -0.0317968 -0.0657451 0.0796239 -0.001852 0.0465332 0.0599953 0.1020154 0.027321 0.0086124 -0.0062492 -0.0198835 -0.1329712 -0.0261814 -0.0968167 -0.0602374 -0.167171 0.0184455 0.0647067 0.0282289 0.1096957 0.0030295 0.0720563 -0.0074654 0.0543864 -0.0498256 -0.0331585 -0.0848412 -0.0851476 0.0798465 -0.0371318 -0.0517652 -0.0123549 0.0559579 -0.0288214 -0.0296704 0.1349295 0.0094267 0.0971952 0.0139559 0.0963994 0.0412615 -0.0507922 0.0967141 0.062159 0.0099914 0.0480091 -0.1523323 -0.0687603 0.0208193 -0.0829019 0.0472826 unknown
polarizability: 89.5614402|-0.7600868|78.3784454|-6.2153013|3.5425448|54.5862269 unknown
InChI: InChI=1S/C5H10ClNO/c1-3-7(4-2)5(6)8/h3-4H2,1-2H3
charge 0 multiplicity 1
18 atoms
Cl 2.407451 0.58677 -0.542815
O  0.340568 2.067155 0.505506
N  -0.198054 -0.160606 0.004394
C  -1.601093 0.007742 0.496653
C  0.183659 -1.495189 -0.524371
C  -2.554997 0.495342 -0.61118
C  0.746212 -2.429234 0.565773
C  0.612001 0.932461 0.086852
H  -1.924504 -0.970279 0.896015
H  -1.584875 0.730176 1.329926
H  -0.727535 -1.931875 -0.973491
H  0.920903 -1.362688 -1.331418
H  -2.248149 1.490287 -0.975186
H  -2.570986 -0.202633 -1.467451
H  -3.583685 0.574805 -0.21521
H  1.683629 -2.019905 0.978302
H  0.026665 -2.562931 1.393564
H  0.96179 -3.4239 0.135336
