program: Gaussian 09
title: 000050985
version: EM64L-G09RevD.01
frameworkgroup: C1[X(C9H12N2O3)]
method: RPBEPBE
basis: SDD
operation: Freq
keyword: #p
keyword: freq=noraman
keyword: PBEPBE/SDD
title: #p freq=noraman PBEPBE/SDD
converged: YES YES NO NO
title: Mulliken charges:
elementType: O O O N N C C C C C C C C C H H H H H H H H H H H H
charge: -0.272079 -0.273674 -0.269754 -0.302066 -0.578222 0.212138 0.157646 0.378898 -0.459233 -0.275860 -0.301998 -0.372119 -0.370094 -0.199096 0.270797 0.189527 0.228299 0.250342 0.253242 0.247653 0.201592 0.234727 0.233637 0.247040 0.267853 0.300804
chargesum: 0.00000
title: Mulliken charges with hydrogens summed into heavy atoms:
elementType: O O O N N C C C C C C C C C
charge: -0.272079 -0.273674 -0.269754 -0.055027 -0.009565 0.212138 0.157646 0.378898 -0.188436 0.141966 -0.051655 -0.118877 0.079151 0.269268
polarizability: 1.84537554e+02 8.01690302e+00 1.18650080e+02 -1.46939322e+00 6.54954240e-01 6.70966343e+01
1716.lowfreq: -71.9475 -2.4804 -0.0007 0.0004 0.0006 7.9550 10.3465 32.9065 56.3344
frequency: -71.9407 32.8737 56.3099 76.5728 86.4529 135.5748 164.7879 200.7437 221.6868 254.7133 325.2022 338.0231 381.1289 414.0070 424.1762 464.5987 488.8085 541.8716 594.1354 597.7455 676.8846 704.1752 712.7632 745.5274 780.8618 802.3597 825.0385 842.2645 847.8201 906.1850 922.6727 974.8825 985.5985 1018.7681 1052.2822 1065.9470 1087.8217 1119.2729 1125.0006 1125.5575 1161.9850 1170.4747 1187.6693 1240.4023 1258.8503 1267.5984 1275.4784 1318.3105 1364.7624 1377.7214 1396.6160 1445.1412 1467.4096 1474.8311 1482.1099 1489.0235 1493.5659 1608.7603 1638.0790 1651.2826 2913.8765 2942.5791 3004.9808 3022.8394 3081.2251 3089.3330 3166.7268 3186.7540 3192.5765 3349.9416 3423.4149 3600.9504
redmass: 2.4039 4.7155 4.2292 3.4715 2.2183 2.5393 7.8033 3.6988 6.1958 5.8238 7.3150 2.4124 1.5283 1.8591 3.0315 2.3061 6.5143 4.0208 6.4728 3.9769 9.6045 3.7853 1.5787 4.4928 6.6264 1.3672 1.3578 7.9416 1.3347 5.2335 1.3226 7.1114 3.9267 2.3919 3.6287 1.4589 3.0058 1.0369 1.3535 1.7015 2.1588 2.3696 1.2121 1.6506 1.5337 1.1770 3.8140 1.2924 1.3352 2.0719 2.4631 4.4957 1.6842 1.1826 1.1748 1.2639 1.1529 7.8530 8.7598 1.0860 1.0714 1.0600 1.0536 1.1008 1.1186 1.0917 1.0886 1.0969 1.0923 1.0745 1.0467 1.0977
irintensity: 13.2561 1.8405 1.0969 5.1877 4.2066 5.5834 2.6260 2.4998 0.3402 0.5780 0.3652 37.1751 150.6521 94.0825 5.7919 38.8941 0.3092 10.5392 8.2536 7.3327 0.2364 1.9868 75.1672 27.2925 21.6010 31.5071 46.0707 32.7262 15.4841 7.9024 0.1303 57.2799 195.8188 1.9123 20.4916 4.4205 2.0791 0.0459 18.4634 1.6984 38.1305 315.6439 11.4906 3.8299 26.5701 0.6068 58.5055 7.8005 2.4796 18.2078 3.2325 15.4884 246.7966 50.4863 36.3077 48.7098 2.6373 38.0834 31.2313 5.7248 71.9570 46.4904 132.1431 37.0070 37.5880 20.9906 4.1386 4.4637 1.0173 19.2691 22.1569 3.5479
temp: 298.150 k
press: 1.00000 atm
elementType: 8 8 8 7 7 6 6 6 6 6 6 6 6 6 1 1 1 1 1 1 1 1 1 1 1 1
symmnumber: 1
zpe: 537520.2 jmol-1
zpe.correction: 0.204731 hartree
zpe.thermalcorrener: 0.217686 hartree
zpe.thermalcorrenthalpy: 0.218630 hartree
zpe.thermalcorrgfe: 0.164029 hartree
zpe.sumelectzpe: -684.178850 hartree
zpe.sumelectthermal: -684.165895 hartree
zpe.sumelectthermalent: -684.164951 hartree
zpe.sumelectthermalfe: -684.219552 hartree
dipole: 1.6717 -1.5992 1.4098
dipole: 2.7092
quadrupole: -61.6519 -80.5138 -82.7345
quadrupole: -0.9532 7.8483 -0.3135
quadrupole: 13.3149 -5.5471 -7.7678 -0.9532 7.8483 -0.3135
hfenergy: -684.3835807 hartree
pointgroup: C01 [X(C9H12N2O3)]
dipole: -0.6387875 -0.6498705 -0.5529112 debye
dipolederiv: -2.016039 -0.1977895 -0.0703922 -0.1854458 -0.3280855 -0.0114055 -0.0576471 -0.007093 -0.2817368 -1.0461154 0.4048532 -0.0539935 0.5528723 -0.8274746 0.0448592 -0.0515127 0.0344894 -0.2555056 -1.2645176 0.3786556 -0.0575223 0.421913 -0.6124816 0.0375533 -0.0494682 0.0289369 -0.2484369 -0.1014509 -0.0355363 -0.1863922 0.0406824 -0.3843475 0.2883504 0.0342861 0.2553232 -0.0994043 -0.1738779 -0.1170401 0.0625376 -0.1042107 -0.424302 -0.3925525 -0.1595374 -0.3459965 -0.3306115 0.4054169 -0.1600975 0.0166293 -0.8871497 0.8214526 -0.0641666 0.0419802 -0.0323751 0.054515 1.0514172 -0.5010621 0.0582041 0.0603664 -0.2445256 0.0155386 0.0297573 -0.0051055 -0.0032953 1.6586573 0.0040749 0.0653212 -0.0942095 0.0522676 -0.0031226 0.0646873 0.0012535 0.0932552 -0.3411627 0.0358272 -0.0069026 0.2676149 -0.0972938 0.0037195 -0.016953 -0.0065396 -0.2224064 0.7662722 0.1653782 0.001786 0.624435 0.3867147 0.0432226 -0.0039836 0.0503165 0.4061273 0.1379238 -0.1226603 0.0171186 0.0272136 0.155025 -0.0121934 0.0099845 -0.0165767 -0.1457352 -0.4700069 0.1454401 -0.0190491 -0.2872742 -0.0228992 -0.0176411 -0.0014005 -0.000583 -0.2156146 0.3128828 0.1570163 0.0119368 0.0929031 0.3641416 -0.126488 0.1346993 -0.079481 0.2427768 1.0290712 -0.3024492 0.0437649 -0.358363 0.7357697 -0.0307411 0.0521975 -0.0307041 0.5877057 0.0775311 -0.070223 -0.0014032 -0.0918153 0.0161057 0.0031979 0.0003846 0.0049551 0.1840433 -0.017901 0.0257485 0.049652 -0.1023168 -0.0683328 -0.101974 0.0080899 -0.1245398 -0.1012926 -0.0040294 0.029381 -0.0505504 -0.0816885 -0.0414904 0.0816615 -0.0347737 0.0965409 -0.0809134 0.0320943 -0.0826223 -0.0022705 -0.0775094 0.0055399 0.0036632 -0.0026675 0.0034872 0.176215 0.063833 0.0761704 -0.0073088 0.0670721 -0.0157513 0.0097059 -0.0073137 0.0103636 0.1790361 0.0765992 0.0127893 0.044552 0.0055274 0.021299 -0.0606466 0.0256318 -0.0793725 -0.0489283 -0.0088121 -0.0300885 -0.022823 -0.0595701 -0.1365053 0.1232068 -0.0100648 0.1737055 -0.0889315 -0.0706215 0.0878154 0.0538119 0.0970468 0.0006938 -0.0413024 0.137787 -0.0951738 -0.0567168 -0.0501432 0.0695489 -0.0580058 0.076519 0.0112987 0.041291 -0.1557235 0.1023182 -0.1039444 0.0151003 -0.0086675 0.1014206 -0.035807 0.2008411 -0.1091064 0.1129162 -0.1971328 -0.029842 -0.104012 0.0544832 -0.038314 0.0902557 0.2731595 0.1239877 -0.0955477 0.1583636 0.1059447 0.0418903 -0.0189459 0.0481924 -0.0590617 0.1591809 0.1513829 -0.0058084 0.1006199 0.2836967 unknown
polarizability: 184.4730509|-7.977446|118.5263709|2.951061|-2.9044529|67.2848459 unknown
InChI: InChI=1S/C9H12N2O3/c10-11-3-4-12-7-1-2-8-9(5-7)14-6-13-8/h1-2,5,11H,3-4,6,10H2
charge 0 multiplicity 1
26 atoms
O  -1.434387 0.92496 -0.173764
O  2.718528 -1.835976 0.087115
O  4.1079 0.129299 0.063308
N  -4.693773 -0.837888 -0.377941
N  -6.039639 -0.540117 -0.039919
C  1.921045 -0.665672 0.017211
C  2.730384 0.48483 0.004226
C  -0.049897 0.692686 -0.109839
C  0.525211 -0.611115 -0.038498
C  -2.327797 -0.243463 -0.163988
C  2.173296 1.765531 -0.065535
C  0.759696 1.857169 -0.122817
C  -3.760629 0.300911 -0.230102
C  4.127181 -1.352759 0.150206
H  -0.071664 -1.524898 -0.023182
H  -2.106046 -0.891102 -1.040518
H  -2.186241 -0.836604 0.760596
H  2.800463 2.660325 -0.075871
H  0.265418 2.830766 -0.177338
H  -4.017355 0.81241 0.710936
H  -3.825258 1.052915 -1.05105
H  4.681273 -1.758984 -0.713705
H  4.563548 -1.65432 1.119239
H  -4.582358 -1.323215 -1.283322
H  -6.634687 -0.102353 -0.752852
H  -6.485712 -1.253736 0.535705
