program: Gaussian 09
title: 000051011
version: EM64L-G09RevD.01
frameworkgroup: C1[X(C10H16N2O2)]
method: RPBEPBE
basis: SDD
operation: Freq
keyword: #p
keyword: freq=noraman
keyword: PBEPBE/SDD
title: #p freq=noraman PBEPBE/SDD
converged: YES YES NO NO
title: Mulliken charges:
elementType: O O N N C C C C C C C C C C H H H H H H H H H H H H H H H H
charge: -0.249165 -0.246555 -0.318648 -0.589398 -0.041647 -0.326747 -0.686862 0.268211 0.177893 -0.331264 -0.336768 -0.254781 -0.250761 -0.538391 0.205623 0.190007 0.222171 0.232603 0.241731 0.203138 0.239008 0.253414 0.240178 0.222734 0.222468 0.300904 0.268255 0.219120 0.218332 0.245198
chargesum: 0.00000
title: Mulliken charges with hydrogens summed into heavy atoms:
elementType: O O N N C C C C C C C C C C
charge: -0.249165 -0.246555 -0.079640 -0.020239 0.163976 0.085430 -0.009390 0.268211 0.177893 -0.077849 -0.096590 -0.032046 -0.028293 0.144259
polarizability: 1.75772343e+02 4.64176725e+00 1.44088355e+02 -1.90938521e+00 -2.73770577e+00 7.92706906e+01
1716.lowfreq: -13.2683 -4.8973 -0.0007 0.0006 0.0007 1.5426 33.0015 38.9215 63.2964
frequency: 33.0010 38.5718 63.2888 91.6566 103.2079 132.4860 167.4479 181.9903 206.2455 234.9837 242.8703 267.6500 303.5003 314.8999 329.6522 355.2201 383.2570 459.6103 474.1988 504.5815 534.3756 560.2295 569.8544 592.8353 715.8820 726.4939 740.7707 746.2137 804.6150 827.3902 869.4575 898.0411 933.3443 950.6535 955.0571 982.8758 986.8029 1047.6208 1077.0665 1110.6709 1115.1265 1136.7893 1150.2661 1156.4051 1162.9585 1172.5166 1199.8186 1225.7814 1228.4980 1246.8084 1278.8315 1303.6839 1347.0133 1366.8985 1379.4852 1400.0077 1426.0419 1441.0012 1461.2799 1464.2666 1466.2860 1471.3099 1482.7898 1486.0893 1497.2527 1593.9801 1601.0054 1645.6977 2896.8788 2928.0329 2954.7915 2989.1975 3012.7094 3041.1013 3089.7717 3109.1899 3123.8303 3132.7908 3148.7096 3162.7754 3173.2811 3324.7470 3429.3566 3612.1829
redmass: 3.5371 3.3096 4.1130 3.3895 3.1451 2.4993 3.3943 3.6160 1.4026 2.1608 1.3983 3.2017 3.1345 3.4398 1.1816 1.3037 3.6908 3.1582 2.5707 6.2721 2.5282 3.9669 4.5395 4.5354 2.0269 3.5520 1.2350 3.3126 5.2062 1.5216 2.5149 1.3805 1.2644 1.9071 1.3655 6.8621 6.4318 2.0917 1.8745 1.2663 1.9976 1.6544 1.4686 1.9271 2.0444 1.0662 2.8131 1.5371 1.6126 3.1819 1.4915 1.2460 1.3852 1.2914 1.5156 4.9166 1.5794 1.5138 1.0564 1.1160 1.0507 1.0874 1.1252 1.1438 2.1989 6.0286 7.5205 1.0870 1.0823 1.0601 1.0331 1.0362 1.1009 1.1037 1.0983 1.1004 1.0989 1.0849 1.0899 1.0931 1.0994 1.0739 1.0469 1.0976
irintensity: 2.3699 1.3708 0.2204 8.9934 5.6579 5.6914 0.0414 0.3319 1.9412 2.5195 0.2583 3.8853 0.3623 5.0665 157.6562 135.0020 0.2364 2.4448 2.2718 4.4847 1.1976 0.0091 3.8427 9.5618 77.5611 0.1907 115.3535 8.7016 10.9773 0.0017 4.5861 3.8054 4.4560 1.4932 0.4915 10.4268 110.5755 19.8806 10.1068 1.3381 114.8989 4.7899 15.4061 1.6222 3.2338 1.0112 147.0481 4.3256 24.7535 196.3375 13.0218 1.4089 7.0824 13.5716 18.1629 0.5194 14.7844 32.2977 21.5983 24.7753 12.6508 57.7178 26.4636 1.0130 106.1614 62.7929 8.8754 6.2315 58.5641 56.3325 70.7924 18.5825 45.9306 52.0750 31.8635 19.8019 22.5275 0.2833 21.2565 29.9874 9.7774 25.9771 15.9480 4.8179
temp: 298.150 k
press: 1.00000 atm
elementType: 8 8 7 7 6 6 6 6 6 6 6 6 6 6 1 1 1 1 1 1 1 1 1 1 1 1 1 1 1 1
symmnumber: 1
zpe: 655289.2 jmol-1
zpe.correction: 0.249586 hartree
zpe.thermalcorrener: 0.264921 hartree
zpe.thermalcorrenthalpy: 0.265865 hartree
zpe.thermalcorrgfe: 0.206409 hartree
zpe.sumelectzpe: -649.446547 hartree
zpe.sumelectthermal: -649.431213 hartree
zpe.sumelectthermalent: -649.430269 hartree
zpe.sumelectthermalfe: -649.489725 hartree
dipole: 0.0667 -0.3601 -1.5573
dipole: 1.5998
quadrupole: -63.8055 -77.2148 -85.5324
quadrupole: -8.5330 -6.9578 -0.2241
quadrupole: 11.7120 -1.6972 -10.0148 -8.5330 -6.9578 -0.2241
hfenergy: -649.6961337 hartree
pointgroup: C01 [X(C10H16N2O2)]
dipole: -0.0051024 -0.2425867 0.5807676 debye
polarizability: 176.1420332|-1.7294601|140.9837816|-4.2498881|12.9831567|82.0055736 unknown
InChI: InChI=1S/C10H16N2O2/c1-8(12-11)7-14-10-6-4-3-5-9(10)13-2/h3-6,8,12H,7,11H2,1-2H3
charge 0 multiplicity 1
30 atoms
O  -0.435205 0.224179 0.094641
O  1.541246 1.950387 0.439525
N  -3.95913 -0.866195 0.224207
N  -5.23896 -0.291065 0.433312
C  -2.844701 0.121525 0.119329
C  -1.561976 -0.701431 -0.090553
C  -3.0831 1.103758 -1.035558
C  0.855296 -0.288094 -0.082207
C  1.926567 0.64472 0.10581
C  1.150963 -1.626694 -0.422031
C  3.261989 0.212845 -0.050345
C  2.494426 -2.048942 -0.577006
C  3.546291 -1.132862 -0.391748
C  2.610194 2.931524 0.63172
H  -2.714802 0.704863 1.062884
H  -1.487983 -1.527353 0.652537
H  -1.548494 -1.135063 -1.110714
H  -2.240695 1.813407 -1.102962
H  -4.021173 1.657947 -0.867936
H  -3.172025 0.553983 -1.990849
H  -3.732068 -1.614396 0.90211
H  0.340914 -2.346341 -0.571053
H  4.087355 0.916882 0.091449
H  2.705894 -3.090142 -0.842249
H  4.587183 -1.451875 -0.510003
H  -5.974669 -0.684506 -0.151052
H  -5.507185 -0.022704 1.386661
H  3.209072 3.063827 -0.290952
H  3.277997 2.644481 1.467946
H  2.092576 3.870735 0.875986
