program: Gaussian 09
title: 000051027
version: EM64L-G09RevD.01
frameworkgroup: C1[X(C15H12O7)]
method: RPBEPBE
basis: SDD
operation: Freq
keyword: #pfreq=noraman
keyword: PBEPBE/SDD
title: #p freq=noraman PBEPBE/SDD
converged: YES YES NO NO
title: Mulliken charges:
elementType: O O O O O O O C C C C C C C C C C C C C C C H H H H H H H H H H H H
charge: -0.227008 -0.274317 -0.272317 -0.151067 -0.149936 -0.238016 -0.246861 0.165532 0.156088 0.261669 -0.443566 -0.343168 -0.337988 0.129272 0.138563 0.190197 -0.267127 -0.264983 0.172717 0.340244 -0.752351 -0.621992 0.312007 0.280783 0.286602 0.236623 0.250739 0.235488 0.246499 0.237825 0.242661 0.218787 0.232369 0.256032
chargesum: 0.00000
title: Mulliken charges with hydrogens summed into heavy atoms:
elementType: O O O O O O O C C C C C C C C C C C C C C C
charge: -0.227008 -0.274317 -0.272317 -0.151067 -0.149936 -0.238016 -0.246861 0.165532 0.156088 0.261669 -0.131559 -0.062385 -0.051386 0.129272 0.138563 0.190197 0.220234 0.217003 0.172717 0.340244 -0.053078 -0.133591
polarizability: 2.53367805e+02 -8.25223878e+00 2.08772919e+02 -2.03603423e+01 9.52210371e+00 1.08467455e+02
1716.lowfreq: -4.4458 -3.4244 -2.0612 0.0004 0.0004 0.0005 8.0997 14.5205 19.0203
frequency: 6.9354 14.4552 18.9633 42.1115 58.2882 73.5643 78.2461 112.4816 139.4589 146.1304 158.2332 168.6544 170.3254 197.7145 231.1137 257.0012 280.7235 285.1151 291.0589 367.9580 370.2026 393.1037 415.9248 422.7630 458.1590 471.6626 486.9225 524.4900 577.3930 582.8645 605.6286 631.1826 638.6610 652.0852 683.0058 724.5450 742.7397 764.0192 768.9169 776.2512 782.3052 784.8242 826.2524 867.5236 888.2242 904.1842 948.0904 960.0683 993.5030 997.4906 1011.8471 1014.4443 1029.0468 1034.2027 1053.8900 1059.9301 1084.6190 1107.0204 1110.3040 1166.5806 1197.0658 1205.3508 1249.7425 1257.8254 1273.1728 1288.1988 1353.3295 1385.8910 1398.0480 1399.8208 1416.3803 1433.9760 1452.2295 1455.5294 1457.3033 1471.0402 1473.6733 1599.0390 1612.6147 1621.2308 1625.3819 1653.2774 1697.8315 1752.3361 2990.8429 3014.1255 3023.6537 3073.7614 3078.9987 3093.5452 3100.3797 3106.2985 3160.1075 3177.5461 3186.1711 3218.7087
redmass: 6.1794 5.9082 4.5400 7.9843 5.1522 6.7450 7.6643 5.7193 3.8209 6.1486 7.7506 1.3640 2.7952 7.8643 4.8179 6.0811 3.6295 5.2143 4.2682 3.4688 5.5195 3.5250 3.0869 4.3857 5.2948 6.4423 3.9554 8.4190 5.0324 5.8190 9.1849 1.5353 6.1194 9.7220 5.9253 7.0034 6.1454 4.0212 5.6339 10.1540 3.7838 2.7178 4.2201 4.2176 1.4575 5.7798 1.9464 1.4697 1.3196 2.6551 1.4436 1.3783 3.6371 2.8344 1.5054 3.2465 3.6313 3.1215 3.1517 1.6138 2.3144 1.1279 1.1098 2.5030 2.1005 3.4299 1.3772 1.6933 1.1638 6.1937 1.2528 5.4240 1.0841 1.0770 1.0463 2.9018 1.0618 9.3877 11.1436 7.4671 10.7440 5.1896 13.1005 12.9864 1.0363 1.0573 1.0599 1.0972 1.1056 1.1065 1.1005 1.0619 1.0895 1.0974 1.0941 1.1158
irintensity: 0.1500 0.4965 1.0589 0.5354 1.4183 1.9224 2.2629 1.2813 4.7613 6.1140 6.9352 0.7537 2.8685 5.8620 5.9564 0.3789 2.0008 0.7366 7.3719 1.2096 10.2985 0.2131 0.7573 22.6841 5.8061 0.6131 9.2439 6.4288 14.0389 3.9264 4.0547 10.0065 0.1457 8.6472 58.7158 1.9080 5.5330 10.4753 0.8024 173.5226 22.2401 6.9708 30.5130 28.0488 23.3190 15.3930 17.6314 9.6016 52.9485 13.2524 20.4279 0.1719 68.2397 38.6706 7.4435 176.3775 257.2631 245.8109 118.8223 75.5777 349.1338 36.0105 6.0810 73.5669 123.5706 72.3512 2.0598 0.8742 22.0726 7.6372 10.2534 5.2490 8.7250 23.5537 17.6642 0.2043 36.6765 46.7273 155.8603 3.1983 163.0811 4.5458 469.0465 184.9166 14.3020 7.8846 19.3892 14.6470 11.6112 19.0074 24.0413 3.4111 0.5556 0.3140 2.8720 4.5780
temp: 298.150 k
press: 1.00000 atm
elementType: 8 8 8 8 8 8 8 6 6 6 6 6 6 6 6 6 6 6 6 6 6 6 1 1 1 1 1 1 1 1 1 1 1 1
symmnumber: 1
zpe: 636220.9 jmol-1
zpe.correction: 0.242324 hartree
zpe.thermalcorrener: 0.262931 hartree
zpe.thermalcorrenthalpy: 0.263875 hartree
zpe.thermalcorrgfe: 0.187967 hartree
zpe.sumelectzpe: -1103.789110 hartree
zpe.sumelectthermal: -1103.768503 hartree
zpe.sumelectthermalent: -1103.767559 hartree
zpe.sumelectthermalfe: -1103.843467 hartree
dipole: 2.9520 3.8287 1.7582
dipole: 5.1443
quadrupole: -148.8777 -134.6971 -125.1160
quadrupole: -18.9591 6.9691 -8.2893
quadrupole: -12.6475 1.5331 11.1143 -18.9591 6.9691 -8.2893
hfenergy: -1104.0314342 hartree
pointgroup: C01 [X(C15H12O7)]
dipole: -1.1682279 -1.4628452 0.7691964 debye
polarizability: 254.0210161|-8.709525|208.3399768|16.750353|-12.8579887|108.247186 unknown
InChI: InChI=1S/C15H12O7/c1-8(2)12(16)20-5-6-21-13(17)9-3-4-10-11(7-9)15(19)22-14(10)18/h3-4,7H,1,5-6H2,2H3
charge 0 multiplicity 1
34 atoms
O  4.318761 2.181709 -0.568512
O  -0.961525 -1.578152 -0.252159
O  -3.567889 -0.275804 0.077317
O  2.128414 2.916483 -1.032868
O  6.140291 0.809985 0.025364
O  0.110331 -3.496759 0.528043
O  -5.35173 0.297899 -1.306066
C  2.596023 0.574428 -0.345406
C  3.815427 -0.064103 -0.022484
C  1.406247 -1.478819 0.069196
C  1.372819 -0.109894 -0.309234
C  3.859442 -1.417635 0.352748
C  2.634078 -2.120084 0.396357
C  2.876187 1.99559 -0.694471
C  4.924479 0.923614 -0.154234
C  0.157098 -2.30177 0.148886
C  -2.263674 -2.299747 -0.172866
C  -3.31632 -1.427829 -0.822801
C  -4.649045 0.546289 -0.295904
C  -4.809433 1.693157 0.655081
C  -3.839237 1.831442 1.809611
C  -5.83386 2.557728 0.413062
H  0.427343 0.378897 -0.556413
H  4.807479 -1.90295 0.601437
H  2.598644 -3.175646 0.684573
H  -2.166867 -3.264059 -0.703968
H  -2.49247 -2.498736 0.888429
H  -4.255669 -1.9951 -0.959307
H  -2.990456 -1.055486 -1.810073
H  -3.866352 0.939969 2.461628
H  -2.800247 1.922268 1.4453
H  -4.0800 2.720653 2.416078
H  -6.013587 3.421902 1.061269
H  -6.5013 2.406161 -0.442213
