program: Orca
programVersion: 5.0.3
elementType: C H C H C C C H H C H H C C H H H H H H H
charge: 1
multiplicity: 1
keywords: PBE0 def2-TZVP EnGrad RIJCOSX verytightscf def2/J soscf
formula: C8H13
InChI: InChI=1/C8H12.H/c1-2-4-6-8-7-5-3-1;/h1-2,7-8H,3-6H2;
21 atoms
C  -1.982255 0.65804 0.117092
H  -2.149551 0.849552 1.181618
C  -1.843332 -0.944021 -0.123823
H  -2.65064 -1.440419 0.417651
C  -0.46539 -1.342671 0.380296
C  0.67756 -1.263252 -0.378552
C  1.983096 -0.658712 0.105221
H  2.154188 -0.859768 1.167393
H  2.846063 -1.011422 -0.462468
C  1.843808 0.944671 -0.121309
H  1.952213 1.167941 -1.187387
H  2.651524 1.437629 0.422719
C  0.466224 1.336778 0.389917
C  -0.679675 1.268392 -0.366187
H  0.547446 -1.264029 -1.464184
H  -1.954702 -1.157391 -1.191602
H  0.000677 0.001767 0.03262
H  -0.553923 1.281958 -1.452198
H  -2.847783 1.014456 -0.444313
H  0.350159 1.326738 1.476332
H  -0.346542 -1.345174 1.466979
totalener: -312.02142556 hartree
nucrepener: 382.90943967 hartree
electener: -694.93086524 hartree
oneelecener: -1166.32986527 hartree
twoeener: 471.39900003 hartree
kineticenergy: 310.13008031 hartree
exchangeener: -34.166039580732 hartree
correlationener: -1.977534083567 hartree
xcener: -36.143573664299 hartree
chargesum: 1.0000000
charge: -0.236037 0.168541 -0.242058 0.182811 -0.077200 -0.065015 -0.236296 0.168433 0.181964 -0.242408 0.168959 0.182796 -0.075544 -0.065112 0.163670 0.169016 0.173858 0.163838 0.182078 0.166943 0.166763
charge: -0.201768 0.156973 -0.201325 0.160410 -0.120049 -0.108851 -0.201902 0.156913 0.160394 -0.201312 0.156849 0.160387 -0.120037 -0.107549 0.167603 0.156870 0.323327 0.167635 0.160466 0.167527 0.167438
qa: -0.2360 0.1685 -0.2421 0.1828 -0.0772 -0.0650 -0.2363 0.1684 0.1820 -0.2424 0.1690 0.1828 -0.0755 -0.0651 0.1637 0.1690 0.1739 0.1638 0.1821 0.1669 0.1668
va: 3.9487 0.9690 3.9575 0.9666 3.8941 3.9029 3.9494 0.9690 0.9668 3.9581 0.9688 0.9667 3.8906 3.9051 0.9648 0.9688 1.0431 0.9647 0.9667 0.9646 0.9645
energy: -312.021425562463
dipole: -0.00077 -0.00159 -0.00236 0.00256 0.00255 0.00510 -0.03398 0.02761 -0.00637
magnitude: 0.00850 au
magnitude: 0.02160 debye
