program: Orca
programVersion: 5.0.3
elementType: C H C H C C C H H C H H C C H H H H H H H
charge: 1
multiplicity: 1
keywords: m062x def2-TZVP EnGrad RIJCOSX verytightscf def2/J soscf
formula: C8H13
InChI: InChI=1/C8H13/c1-2-4-6-8-7-5-3-1/h1-2,7H,3-6,8H2
21 atoms
C  -2.000567 0.757227 0.069293
H  -2.162329 0.822307 1.147889
C  -1.729699 -0.971864 -0.161671
H  -2.618723 -1.324606 0.365272
C  -0.413752 -1.387441 0.390696
C  0.684185 -1.273669 -0.381807
C  1.999387 -0.694991 0.062586
H  2.205512 -0.897513 1.119091
H  2.854817 -1.035586 -0.52709
C  1.787893 0.849039 -0.137131
H  1.824831 1.112061 -1.200041
H  2.591833 1.399365 0.35877
C  0.423063 1.272861 0.493611
C  -0.767278 1.296102 -0.367067
H  0.519143 -1.195811 -1.461157
H  -1.83143 -1.13101 -1.235679
H  0.203886 0.660064 1.372188
H  -0.659376 1.61696 -1.406879
H  -2.883176 0.995945 -0.522389
H  0.48859 2.306102 0.898413
H  -0.330559 -1.480526 1.472806
totalener: -312.27086469 hartree
nucrepener: 379.31511885 hartree
electener: -691.58598354 hartree
oneelecener: -1159.45936133 hartree
twoeener: 467.87337779 hartree
kineticenergy: 310.39769216 hartree
xcener: -23.089785682194 hartree
chargesum: 1.0000000
charge: -0.362151 0.239039 -0.273277 0.215586 -0.198055 -0.100541 -0.335839 0.199482 0.194731 -0.321314 0.197973 0.195882 -0.261199 0.133428 0.172773 0.221293 0.188617 0.233455 0.216298 0.244015 0.199803
charge: -0.166706 0.174630 -0.116598 0.163440 -0.186728 -0.123466 -0.225514 0.154791 0.154210 -0.209547 0.149228 0.156586 -0.213591 0.105017 0.156338 0.157796 0.172826 0.175530 0.162805 0.205666 0.153287
qa: -0.3622 0.2390 -0.2733 0.2156 -0.1981 -0.1005 -0.3358 0.1995 0.1947 -0.3213 0.1980 0.1959 -0.2612 0.1334 0.1728 0.2213 0.1886 0.2335 0.2163 0.2440 0.1998
va: 3.7763 0.9334 3.6977 0.9478 3.6566 3.6576 3.7478 0.9491 0.9624 3.7310 0.9472 0.9572 3.6908 3.4118 0.9554 0.9394 0.9674 0.9376 0.9573 0.9316 0.9522
energy: -312.270864687379
dipole: 0.19011 -1.06747 -0.87736 1.73039 -0.56889 1.16150 0.35696 -0.49310 -0.13614
magnitude: 1.46198 au
magnitude: 3.71606 debye
