program: Orca
programVersion: 5.0.3
elementType: C H C H C C C H H C H H C C H H H H H H H
charge: 1
multiplicity: 1
keywords: DSD-PBEP86/2013 cc-pVTZ EnGrad D3BJ RIJCOSX verytightscf cc-pVTZ/C def2/J soscf
formula: C8H13
InChI: InChI=1/C8H13/c1-2-4-6-8-7-5-3-1/h1-2,7H,3-6,8H2
21 atoms
C  -1.99778 0.528988 0.119815
H  -2.175937 0.722721 1.181077
C  -1.958015 -0.998063 -0.169806
H  -2.676103 -1.59163 0.398134
C  -0.519346 -1.136076 0.281257
C  0.609477 -1.120939 -0.504701
C  1.906967 -0.650818 0.064379
H  2.006436 -0.952499 1.112471
H  2.761274 -1.04496 -0.492599
C  1.896647 0.914378 -0.034582
H  2.024853 1.208304 -1.082965
H  2.743524 1.32684 0.520124
C  0.558315 1.481307 0.489557
C  -0.546097 0.81815 -0.262587
H  0.530192 -1.299242 -1.576661
H  -2.074265 -1.208557 -1.237012
H  0.442459 1.361496 1.57165
H  -0.421125 0.881866 -1.346495
H  -2.713954 1.099968 -0.479528
H  0.521039 2.560947 0.272778
H  -0.369002 -1.08506 1.360873
totalener: -311.16885856 hartree
nucrepener: 385.59551521 hartree
electener: -696.76437377 hartree
oneelecener: -1171.43017257 hartree
twoeener: 474.66579880 hartree
kineticenergy: 309.74421822 hartree
exchangeener: -14.127374068091 hartree
correlationener: -0.947907473272 hartree
xcener: -15.075281541363 hartree
chargesum: 1.0000000
charge: -0.216306 0.167343 -0.233524 0.183286 -0.063118 -0.064016 -0.248980 0.163766 0.182528 -0.247310 0.158981 0.181378 -0.232194 -0.063270 0.223364 0.166671 0.163140 0.201698 0.182180 0.196136 0.198248
charge: 0.096915 -0.000136 0.101165 -0.000860 0.126266 0.163683 0.082106 0.001305 0.006474 0.097719 -0.006328 -0.000260 0.064792 0.231414 0.001642 -0.000285 -0.001404 0.002669 0.000920 0.023140 0.009064
qa: -0.2163 0.1673 -0.2335 0.1833 -0.0631 -0.0640 -0.2490 0.1638 0.1825 -0.2473 0.1590 0.1814 -0.2322 -0.0633 0.2234 0.1667 0.1631 0.2017 0.1822 0.1961 0.1982
va: 3.8657 0.9860 3.8848 0.9769 3.7996 3.7884 3.9202 0.9842 0.9766 3.8906 0.9818 0.9728 3.8968 3.7324 0.9609 0.9865 0.9843 0.9765 0.9751 0.9678 0.9780
dispcorr: -0.013848083 hartree
energy: -311.857393619602
dipole: 0.56170 -0.72981 -0.16811 1.85360 -1.76859 0.08501 0.18900 -0.34357 -0.15456
magnitude: 0.24368 au
magnitude: 0.61937 debye
