program: Gaussian 09
title: 000050987
version: EM64L-G09RevD.01
frameworkgroup: C1[X(C10H16N2OS)]
method: RPBEPBE
basis: SDD
operation: Freq
keyword: #p
keyword: freq=noraman
keyword: PBEPBE/SDD
title: #p freq=noraman PBEPBE/SDD
converged: YES YES NO NO
title: Mulliken charges:
elementType: S O N N C C C C C C C C C C H H H H H H H H H H H H H H H H
charge: 0.186124 -0.266784 -0.311959 -0.591347 0.049836 -0.737967 -0.669781 -0.218816 -0.242244 -0.192150 0.329779 -0.341624 -0.343548 -0.538389 0.210587 0.248455 0.268943 0.243910 0.212168 0.206654 0.240638 0.253599 0.251509 0.242914 0.252681 0.266169 0.300163 0.220762 0.246407 0.223310
chargesum: 0.00000
title: Mulliken charges with hydrogens summed into heavy atoms:
elementType: S O N N C C C C C C C C C C
charge: 0.186124 -0.266784 -0.071320 -0.025015 0.260423 -0.220569 -0.007049 -0.218816 0.011354 0.059359 0.329779 -0.098709 -0.090867 0.152090
polarizability: 1.94108380e+02 2.10047231e+01 1.22221625e+02 -9.68344829e-01 6.44715279e+00 1.23370028e+02
1716.lowfreq: -11.9722 -0.0016 -0.0009 0.0018 4.7321 7.7338 17.9707 24.5936 35.6931
frequency: 17.8524 24.5478 35.4321 73.9739 103.3609 124.2066 146.4878 192.1258 199.6182 227.7333 234.4364 278.0689 294.8783 328.9217 335.7359 350.6919 379.4395 389.9598 416.8978 439.8185 476.5745 518.6042 532.8491 598.1788 626.4581 686.6799 713.8709 718.9427 770.3638 813.3216 825.8403 835.2125 884.6838 935.8111 942.9755 962.2269 986.9151 993.7853 1057.8924 1074.0516 1086.9962 1102.1513 1112.5716 1141.4284 1153.3677 1154.8979 1173.6943 1208.1804 1217.6199 1225.9797 1256.8344 1285.1375 1325.5895 1339.2493 1360.8660 1369.0980 1404.2006 1427.2876 1435.2167 1460.1914 1467.2592 1469.9199 1477.0970 1478.3319 1484.7335 1573.5146 1602.1542 1645.0057 2879.3486 2960.1018 2985.4128 2999.6904 3048.1875 3083.6527 3087.0854 3102.1672 3126.8451 3140.2697 3144.5100 3165.6225 3169.6711 3327.2570 3418.9872 3601.3901
redmass: 3.5275 4.3548 3.1508 3.6713 3.1848 3.1278 4.2255 2.4383 3.1997 1.1519 1.3808 3.2020 4.2814 3.0315 1.9281 2.4259 3.1344 1.5349 2.9768 2.3545 4.1554 2.5971 2.1691 6.1517 7.0734 3.9214 3.5367 1.8017 5.9566 1.3074 1.8111 1.7477 1.5719 1.9558 1.3403 1.3522 8.5866 3.5989 1.5721 2.7946 1.6222 1.3536 1.2601 2.4936 2.0156 1.3330 1.1864 1.4465 1.5332 3.6509 1.2516 1.2705 1.3043 1.3873 5.0261 1.2228 4.0068 1.0974 1.1873 1.0499 1.0533 1.3216 1.1510 1.5609 1.0783 7.3560 6.3702 1.0866 1.0820 1.0330 1.0353 1.0603 1.1040 1.1012 1.1012 1.0995 1.0993 1.0890 1.0881 1.0955 1.0967 1.0742 1.0470 1.0971
irintensity: 1.0280 0.1469 1.2180 3.8336 2.6351 5.2368 2.7269 1.7998 1.1008 1.7727 1.2800 2.7032 1.7463 10.8678 17.3536 20.7749 46.9678 186.9899 0.1792 2.2074 2.6947 28.4411 2.7575 15.8043 1.3212 39.6615 0.3418 50.8662 2.7465 17.5029 18.5383 57.8450 4.8355 6.9480 0.3010 0.6352 38.8183 15.3645 7.4795 0.5957 13.2618 12.9568 0.1985 5.1783 7.8058 1.2062 52.7787 8.6746 3.5700 201.4472 0.5254 1.5441 4.2168 6.3622 6.5246 37.4313 2.3169 6.8318 18.9945 4.3706 15.2580 133.2947 14.1280 31.2013 3.5785 14.8152 58.8746 6.9006 64.4240 65.4077 26.6124 25.9878 47.9692 12.8347 34.7065 15.6012 26.1382 4.3411 6.6698 13.7077 3.5586 21.2012 15.3275 4.0072
temp: 298.150 k
press: 1.00000 atm
elementType: 16 8 7 7 6 6 6 6 6 6 6 6 6 6 1 1 1 1 1 1 1 1 1 1 1 1 1 1 1 1
symmnumber: 1
zpe: 647348.4 jmol-1
zpe.correction: 0.246562 hartree
zpe.thermalcorrener: 0.262527 hartree
zpe.thermalcorrenthalpy: 0.263472 hartree
zpe.thermalcorrgfe: 0.201112 hartree
zpe.sumelectzpe: -972.301660 hartree
zpe.sumelectthermal: -972.285694 hartree
zpe.sumelectthermalent: -972.284750 hartree
zpe.sumelectthermalfe: -972.347110 hartree
dipole: 1.8588 3.4793 -0.1985
dipole: 3.9497
quadrupole: -86.8718 -90.0901 -87.2469
quadrupole: 1.8772 10.3460 2.0595
quadrupole: 1.1978 -2.0205 0.8227 1.8772 10.3460 2.0595
hfenergy: -972.5482216 hartree
pointgroup: C01 [X(C10H16N2O1S1)]
dipole: 0.7314641 1.3684923 -0.0830567 debye
polarizability: 194.0569175|21.0919644|121.9480809|-3.1046124|5.69447|123.6950343 unknown
InChI: InChI=1S/C10H16N2OS/c1-8(12-11)7-14-10-5-3-9(13-2)4-6-10/h3-6,8,12H,7,11H2,1-2H3
charge 0 multiplicity 1
30 atoms
S  -1.246707 -2.118296 0.342339
O  4.038262 0.728349 -0.599549
N  -3.496745 1.24037 -0.689031
N  -3.80986 2.51505 -0.14219
C  -2.774266 0.327226 0.249293
C  -2.447389 -0.948165 -0.553945
C  -3.64171 0.036356 1.482709
C  0.338328 -1.211772 0.075799
C  0.957185 -0.537405 1.150867
C  0.972905 -1.228252 -1.193168
C  2.815945 0.10847 -0.300695
C  2.198283 0.119304 0.974885
C  2.199106 -0.56643 -1.38616
C  4.730068 1.421222 0.490268
H  -1.81023 0.781297 0.587977
H  -1.983699 -0.707532 -1.529181
H  -3.358754 -1.544352 -0.73208
H  -3.897286 0.983693 1.985804
H  -3.100461 -0.620247 2.18696
H  -4.581801 -0.459018 1.176873
H  -3.01065 1.293684 -1.601071
H  0.469826 -0.528461 2.131246
H  0.510964 -1.774482 -2.022796
H  2.659541 0.63003 1.825345
H  2.703091 -0.571017 -2.357356
H  -3.081692 3.239117 -0.15182
H  -4.756536 2.831324 -0.349611
H  4.120655 2.25628 0.887639
H  5.651981 1.816779 0.03966
H  4.985344 0.724477 1.312292
