program: Orca
programVersion: 5.0.3
elementType: C H C H C C C H H C H H C C H H H H H H H
charge: 1
multiplicity: 1
keywords: PBE0 cc-pVTZ EnGrad RIJCOSX verytightscf cc-pVTZ/C def2/J soscf
formula: C8H13
InChI: InChI=1/C8H13/c1-2-4-6-8-7-5-3-1/h1-2,7H,3-6,8H2
21 atoms
C  -2.003907 0.71726 0.082113
H  -2.210494 0.876792 1.144293
C  -1.768158 -0.926107 -0.142819
H  -2.61981 -1.375388 0.372459
C  -0.430778 -1.352189 0.41037
C  0.698596 -1.284185 -0.363371
C  2.009682 -0.686795 0.07213
H  2.223485 -0.880219 1.128528
H  2.859252 -1.019801 -0.527654
C  1.803215 0.90083 -0.143083
H  1.862716 1.133158 -1.211484
H  2.618443 1.42568 0.358531
C  0.426383 1.278391 0.432095
C  -0.736718 1.318265 -0.367043
H  0.530658 -1.205896 -1.442164
H  -1.853667 -1.128735 -1.2133
H  0.057067 0.155712 0.645081
H  -0.591311 1.316483 -1.451787
H  -2.867281 0.995704 -0.523404
H  0.358437 1.632257 1.467222
H  -0.347434 -1.514489 1.487235
totalener: -312.00940446 hartree
nucrepener: 381.64974659 hartree
electener: -693.65915105 hartree
oneelecener: -1164.00217560 hartree
twoeener: 470.34302455 hartree
kineticenergy: 309.59482733 hartree
exchangeener: -34.139605458535 hartree
correlationener: -1.971326480590 hartree
xcener: -36.110931939125 hartree
chargesum: 1.0000000
charge: -0.190756 0.156818 -0.213030 0.164326 -0.099704 -0.053564 -0.184190 0.142785 0.154958 -0.205968 0.144961 0.156102 -0.117434 0.045334 0.152131 0.155286 0.105989 0.171984 0.168542 0.179683 0.165748
charge: 0.111927 0.003018 0.126262 0.005350 0.061225 0.129734 0.091147 -0.002169 0.000155 0.115420 -0.006351 0.000248 0.102212 0.233751 -0.006131 -0.003566 0.002645 0.008286 0.006001 0.024867 -0.004031
qa: -0.1908 0.1568 -0.2130 0.1643 -0.0997 -0.0536 -0.1842 0.1428 0.1550 -0.2060 0.1450 0.1561 -0.1174 0.0453 0.1521 0.1553 0.1060 0.1720 0.1685 0.1797 0.1657
va: 3.8594 0.9887 3.9132 0.9838 3.8038 3.8125 3.8720 0.9929 0.9849 3.9020 0.9926 0.9884 3.8048 3.7062 0.9912 0.9885 1.1029 0.9860 0.9831 0.9922 0.9937
energy: -312.009404462814
dipole: 0.01882 -0.35197 -0.33315 0.38585 0.05847 0.44432 0.21913 -0.24766 -0.02854
magnitude: 0.55608 au
magnitude: 1.41344 debye
