program: Orca
programVersion: 5.0.3
elementType: C H C H C C C H H C H H C C H H H H H H H
charge: 1
multiplicity: 1
keywords: DSD-PBEP86/2013 cc-pVTZ EnGrad D3BJ RIJCOSX verytightscf cc-pVTZ/C def2/J soscf
formula: C8H13
InChI: InChI=1/C8H13/c1-2-4-6-8-7-5-3-1/h1-2,7H,3-6,8H2
21 atoms
C  -1.997624 0.746683 0.074937
H  -2.18192 0.856054 1.146941
C  -1.741858 -0.946087 -0.149455
H  -2.618306 -1.328957 0.37819
C  -0.42471 -1.374358 0.400847
C  0.692509 -1.283088 -0.368699
C  2.005606 -0.687857 0.066018
H  2.217468 -0.87862 1.123825
H  2.858053 -1.028222 -0.526833
C  1.795756 0.882563 -0.145018
H  1.85087 1.129448 -1.210491
H  2.604701 1.420235 0.355206
C  0.422398 1.255116 0.462616
C  -0.760227 1.314953 -0.378846
H  0.528503 -1.213132 -1.448604
H  -1.842166 -1.122644 -1.221281
H  0.133728 0.354589 1.067346
H  -0.64076 1.459232 -1.456395
H  -2.875043 0.984432 -0.526222
H  0.408213 1.985364 1.288817
H  -0.344808 -1.508702 1.480688
totalener: -311.09989699 hartree
nucrepener: 380.25805525 hartree
electener: -691.35795225 hartree
oneelecener: -1160.84863476 hartree
twoeener: 469.49068251 hartree
kineticenergy: 309.69655291 hartree
exchangeener: -14.114698938388 hartree
correlationener: -0.944197295388 hartree
xcener: -15.058896233776 hartree
chargesum: 1.0000000
charge: -0.254872 0.193504 -0.251958 0.198915 -0.146778 -0.115411 -0.237219 0.157272 0.175567 -0.262898 0.161921 0.179825 -0.234053 0.097155 0.166734 0.187563 0.147603 0.219684 0.201788 0.228146 0.187510
charge: 0.126989 0.010956 0.158420 0.008788 0.023216 0.084122 0.080790 -0.005273 -0.003866 0.107167 -0.012476 -0.002023 0.078942 0.301841 -0.016229 -0.001460 0.017093 0.014472 0.007703 0.037645 -0.016817
qa: -0.2549 0.1935 -0.2520 0.1989 -0.1468 -0.1154 -0.2372 0.1573 0.1756 -0.2629 0.1619 0.1798 -0.2341 0.0972 0.1667 0.1876 0.1476 0.2197 0.2018 0.2281 0.1875
va: 3.8869 0.9736 3.9226 0.9664 3.8262 3.8394 3.9037 0.9866 0.9759 3.8973 0.9842 0.9763 3.8588 3.5852 0.9822 0.9738 1.0289 0.9639 0.9705 0.9634 0.9819
dispcorr: -0.014336591 hartree
energy: -311.792328791681
dipole: 0.09228 -0.90347 -0.81119 1.03917 -0.10297 0.93620 0.42294 -0.49190 -0.06896
magnitude: 1.24067 au
magnitude: 3.15352 debye
