program: Gaussian 09
title: 000050989
version: EM64L-G09RevD.01
frameworkgroup: C1[X(C12H20N2O2)]
method: RPBEPBE
basis: SDD
operation: Freq
keyword: #p
keyword: freq=noraman
keyword: PBEPBE/SDD
title: #p freq=noraman PBEPBE/SDD
converged: YES YES NO NO
title: Mulliken charges:
elementType: O O N N C C C C C C C C C C C C H H H H H H H H H H H H H H H H H H H H
charge: -0.288246 -0.294009 -0.303478 -0.576299 -0.532664 0.552896 -0.362265 -0.526583 -0.467902 0.243884 0.179118 -0.333621 -0.686752 -0.275917 -0.370801 -0.523891 0.198565 0.199867 0.212116 0.210119 0.256370 0.229846 0.244689 0.219047 0.209392 0.210144 0.193868 0.226643 0.242927 0.203827 0.247581 0.208840 0.258315 0.226581 0.267507 0.300287
chargesum: 0.00000
title: Mulliken charges with hydrogens summed into heavy atoms:
elementType: O O N N C C C C C C C C C C C C
charge: -0.288246 -0.294009 -0.055897 -0.008504 -0.134232 0.552896 0.059970 -0.270213 -0.238056 0.243884 0.179118 -0.088932 -0.048169 0.144593 0.075952 0.169844
polarizability: 2.24842360e+02 -8.49873568e+00 1.52940602e+02 -6.96126492e+00 -7.21851560e-02 9.86481425e+01
1716.lowfreq: -10.1319 -7.2035 -5.0113 -0.0012 -0.0008 -0.0005 15.5542 27.1012 50.8000
frequency: 14.3341 27.0989 50.7887 54.6032 67.8691 73.2720 82.5412 97.0569 124.9283 140.4822 164.5428 198.6417 208.5189 225.0847 232.2767 275.0300 312.9015 319.0063 349.2834 387.4850 406.3385 433.9071 458.4909 472.0087 511.6139 530.1663 603.9567 637.8732 707.6072 712.4262 737.2009 745.6538 765.5260 801.7610 839.3930 862.3923 872.6926 895.6006 906.5390 929.4518 975.6048 993.3250 1018.0494 1048.9716 1070.0366 1087.3271 1095.0483 1110.9464 1111.9236 1125.2370 1156.2658 1161.7788 1164.9161 1187.8496 1203.9769 1220.7664 1240.3653 1253.7554 1265.0124 1267.0396 1281.5139 1291.2846 1315.9301 1338.4414 1370.3485 1388.6032 1390.9005 1403.0438 1437.4494 1454.1657 1468.4645 1468.7322 1475.0350 1476.1931 1476.8671 1481.6447 1488.5905 1491.8467 1496.9508 1579.2387 1615.4268 1652.2344 2914.0840 2948.2496 2969.2690 2970.3161 2972.0384 2982.0684 3014.6116 3026.1007 3040.2509 3069.6126 3072.1198 3077.7985 3086.0839 3121.8060 3126.2773 3141.1098 3161.0042 3351.2041 3418.7430 3594.5255
redmass: 3.3117 3.7956 2.1455 3.1050 2.7008 2.1096 1.9987 2.7997 2.2326 2.1158 2.5503 3.7971 3.9426 2.7931 1.2698 3.0679 3.2718 3.2959 2.3654 2.5983 2.3517 1.8123 2.9390 2.6235 3.4845 4.7906 4.8105 4.3001 4.5771 1.5996 2.9002 1.1698 3.6800 1.4248 1.1788 1.5229 1.7501 2.5077 1.8090 1.3526 6.6763 3.8993 2.4275 2.9050 1.4571 2.9654 2.1521 1.2409 2.4231 1.7400 1.3888 2.1290 1.7146 1.2182 1.8956 1.4024 1.5826 3.0667 1.2585 1.2500 1.2264 1.5642 1.2653 1.4999 2.9398 1.2177 1.9019 2.2776 1.4244 1.0706 1.1346 1.0936 1.1584 1.0552 1.0497 1.0536 1.0870 1.3613 1.6605 7.2299 6.7689 1.0853 1.0712 1.0595 1.0527 1.0350 1.0420 1.0603 1.0995 1.1014 1.1031 1.1014 1.0991 1.0969 1.0920 1.1043 1.0888 1.0913 1.0939 1.0744 1.0467 1.0974
irintensity: 0.3872 1.0400 5.4260 0.7391 1.6464 6.5541 0.9905 1.8351 4.7871 4.5291 0.9668 5.4627 1.0811 1.6535 0.2939 0.4923 4.2171 6.7643 27.2682 40.3786 51.9176 114.7597 45.5031 13.3477 17.9972 5.9573 9.6626 5.9697 14.5230 80.7105 4.4062 4.8297 19.3603 44.0264 2.6573 5.0099 9.9876 5.4986 7.7784 1.0698 91.7031 46.8948 3.3890 1.3067 8.5807 0.4250 17.2113 9.3150 103.0356 2.8974 10.7320 2.1713 8.3519 11.2988 102.0955 0.4308 1.5373 204.1910 1.2641 1.3692 5.1955 13.2989 0.2011 1.8540 14.6764 10.2418 4.5647 12.3587 10.7473 12.9917 7.1222 3.9461 57.1149 6.3982 7.9912 15.0376 16.0224 97.7294 58.7770 18.5533 9.6965 5.3094 68.8092 49.2406 8.2035 88.2554 53.0635 57.1358 1.4207 33.3825 12.9104 79.4335 48.1456 37.4980 23.6790 20.1841 16.1729 9.2123 13.8084 18.2024 22.3018 3.3899
temp: 298.150 k
press: 1.00000 atm
elementType: 8 8 7 7 6 6 6 6 6 6 6 6 6 6 6 6 1 1 1 1 1 1 1 1 1 1 1 1 1 1 1 1 1 1 1 1
symmnumber: 1
zpe: 800868.3 jmol-1
zpe.correction: 0.305035 hartree
zpe.thermalcorrener: 0.323787 hartree
zpe.thermalcorrenthalpy: 0.324731 hartree
zpe.thermalcorrgfe: 0.255350 hartree
zpe.sumelectzpe: -727.893401 hartree
zpe.sumelectthermal: -727.874649 hartree
zpe.sumelectthermalent: -727.873705 hartree
zpe.sumelectthermalfe: -727.943086 hartree
dipole: -2.3289 -1.7923 0.1308
dipole: 2.9417
quadrupole: -73.4979 -92.9792 -99.7801
quadrupole: 3.9072 6.9072 4.6729
quadrupole: 15.2544 -4.2268 -11.0277 3.9072 6.9072 4.6729
hfenergy: -728.1984359 hartree
pointgroup: C01 [X(C12H20N2O2)]
dipole: -0.8902021 -0.7387808 0.0346705 debye
polarizability: 225.628071|-5.7974088|152.4002743|-4.0329249|-0.7192129|98.4027589 unknown
InChI: InChI=1S/C12H20N2O2/c1-3-4-10-5-6-11(12(9-10)15-2)16-8-7-14-13/h5-6,9,14H,3-4,7-8,13H2,1-2H3
charge 0 multiplicity 1
36 atoms
O  -1.767855 0.317379 0.084046
O  0.050128 2.470633 -0.330845
N  -5.082989 -1.348983 0.07081
N  -6.405673 -1.002447 0.457561
C  3.938971 -0.590146 -0.28847
C  2.434087 -0.385261 -0.195725
C  4.679558 -0.270718 1.040841
C  1.877194 0.916965 -0.267479
C  1.55078 -1.471301 0.006265
C  -0.389521 0.033789 0.031997
C  0.491119 1.14477 -0.152809
C  0.156413 -1.267794 0.121404
C  6.205678 -0.471353 0.928107
C  -2.694447 -0.822225 0.172897
C  -4.112397 -0.23581 0.163459
C  -0.842569 3.038166 0.699911
H  4.159997 -1.637873 -0.572794
H  4.362227 0.051942 -1.086985
H  4.4568 0.773621 1.335919
H  4.271087 -0.91454 1.844534
H  2.515809 1.793512 -0.426192
H  1.950155 -2.490486 0.069765
H  -0.499786 -2.131459 0.264997
H  6.713909 -0.24393 1.883088
H  6.450091 -1.515608 0.655115
H  6.636498 0.187168 0.150035
H  -2.535174 -1.497119 -0.695785
H  -2.523118 -1.395937 1.104232
H  -4.315705 0.292847 1.108328
H  -4.191065 0.507237 -0.664287
H  -5.023039 -1.846444 -0.832733
H  -0.349394 3.017272 1.691662
H  -1.798026 2.490579 0.743287
H  -1.006965 4.081175 0.388044
H  -7.013677 -0.563236 -0.244074
H  -6.852001 -1.702985 1.049778
