program: Orca
programVersion: 5.0.3
elementType: C H C H C C C H H C H H C C H H H H H H H
charge: 1
multiplicity: 1
keywords: DSD-PBEP86/2013 def2-TZVP D3BJ RIJCOSX verytightscf def2-TZVP/C def2/J soscf noTRAH
formula: C8H13
InChI: InChI=1/C8H13/c1-2-4-6-8-7-5-3-1/h1-2,7H,3-6,8H2
21 atoms
C  -2.002804 0.70954 0.072017
H  -2.175679 0.796196 1.148561
C  -1.747209 -0.969852 -0.171016
H  -2.626102 -1.375045 0.337199
C  -0.410348 -1.373647 0.380127
C  0.674678 -1.267505 -0.399572
C  1.986052 -0.706796 0.065681
H  2.182502 -0.92846 1.119956
H  2.847111 -1.03845 -0.522508
C  1.794562 0.831305 -0.124794
H  1.827905 1.09374 -1.188121
H  2.60313 1.378652 0.367074
C  0.43603 1.331021 0.498964
C  -0.756126 1.274329 -0.341632
H  0.514934 -1.190703 -1.479599
H  -1.830908 -1.140468 -1.246178
H  0.252192 0.883196 1.477837
H  -0.656344 1.63153 -1.371179
H  -2.870792 0.992593 -0.524369
H  0.55422 2.42617 0.663402
H  -0.317628 -1.44888 1.463053
totalener: -311.13471455 hartree
nucrepener: 379.06585541 hartree
electener: -690.20056996 hartree
oneelecener: -1158.59506712 hartree
twoeener: 468.39449716 hartree
kineticenergy: 310.01709856 hartree
exchangeener: -14.121607408611 hartree
correlationener: -0.942665037460 hartree
xcener: -15.064272446071 hartree
chargesum: 1.0000000
charge: -0.258590 0.193589 -0.205443 0.187550 -0.198579 -0.115382 -0.207984 0.152858 0.163795 -0.265901 0.153256 0.171040 -0.153572 0.117949 0.139608 0.182732 0.160309 0.218185 0.191930 0.205935 0.166715
charge: -0.171383 0.169087 -0.132091 0.154967 -0.171313 -0.135001 -0.218373 0.149027 0.149784 -0.197499 0.143430 0.150636 -0.202887 0.162748 0.151056 0.151692 0.162023 0.175960 0.158776 0.200624 0.148734
qa: -0.2586 0.1936 -0.2054 0.1875 -0.1986 -0.1154 -0.2080 0.1529 0.1638 -0.2659 0.1533 0.1710 -0.1536 0.1179 0.1396 0.1827 0.1603 0.2182 0.1919 0.2059 0.1667
va: 3.8739 0.9600 3.8374 0.9610 3.8650 3.8443 3.8770 0.9733 0.9725 3.9041 0.9683 0.9643 3.8199 3.5159 0.9687 0.9614 0.9841 0.9399 0.9659 0.9509 0.9656
total: -311.786909216 hartree
dispcorr: -0.014125087 hartree
energy: -311.801034302759
dipole: 0.28519 -1.10403 -0.81884 1.94750 -0.56662 1.38089 0.22951 -0.41555 -0.18604
magnitude: 1.61616 au
magnitude: 4.10794 debye
