program: Orca
programVersion: 5.0.3
elementType: C H C H C C C H H C H H C C H H H H H H H
charge: 1
multiplicity: 1
keywords: b3lyp def2-TZVP EnGrad RIJCOSX verytightscf def2/J soscf
formula: C8H13
InChI: InChI=1/C8H13/c1-2-4-6-8-7-5-3-1/h1-2,7H,3-6,8H2
21 atoms
C  -1.990158 0.561911 0.10408
H  -2.166255 0.744532 1.168996
C  -1.871696 -0.972793 -0.174767
H  -2.662988 -1.528395 0.335146
C  -0.466775 -1.259927 0.326631
C  0.635016 -1.205495 -0.464569
C  1.926138 -0.682851 0.072405
H  2.066877 -0.94691 1.125825
H  2.794631 -1.038061 -0.491389
C  1.843477 0.871502 -0.079618
H  1.905184 1.138169 -1.141403
H  2.690495 1.350657 0.419554
C  0.514009 1.45584 0.510311
C  -0.636803 1.064214 -0.307721
H  0.530473 -1.298654 -1.546192
H  -1.945343 -1.169653 -1.249171
H  0.376769 1.209238 1.566677
H  -0.51545 1.241889 -1.380657
H  -2.789643 1.026227 -0.484554
H  0.610295 2.556018 0.428523
H  -0.331896 -1.250905 1.409768
totalener: -312.23847548 hartree
nucrepener: 381.60477607 hartree
electener: -693.84325155 hartree
oneelecener: -1164.23668446 hartree
twoeener: 470.39343291 hartree
kineticenergy: 310.52886930 hartree
exchangeener: -36.327014188931 hartree
correlationener: -2.305069661698 hartree
xcener: -38.632083850629 hartree
chargesum: 1.0000000
charge: -0.185617 0.158137 -0.192958 0.164899 -0.091302 -0.080237 -0.209787 0.148808 0.160838 -0.219710 0.144825 0.163117 -0.139350 0.014843 0.163421 0.151707 0.148093 0.189902 0.168540 0.186667 0.155163
charge: -0.200667 0.159400 -0.195850 0.152351 -0.074859 -0.098728 -0.215412 0.154196 0.160217 -0.198687 0.148800 0.153689 -0.217472 0.114400 0.159064 0.154795 0.157617 0.170654 0.162013 0.194936 0.159541
qa: -0.1856 0.1581 -0.1930 0.1649 -0.0913 -0.0802 -0.2098 0.1488 0.1608 -0.2197 0.1448 0.1631 -0.1393 0.0148 0.1634 0.1517 0.1481 0.1899 0.1685 0.1867 0.1552
va: 3.8417 0.9696 3.8324 0.9699 3.8266 3.8107 3.8888 0.9692 0.9700 3.8507 0.9686 0.9643 3.8478 3.6215 0.9636 0.9732 0.9753 0.9494 0.9687 0.9590 0.9663
energy: -312.238475477962
dipole: 0.52770 -0.85203 -0.32433 1.90422 -1.18772 0.71650 0.15079 -0.27471 -0.12391
magnitude: 0.79619 au
magnitude: 2.02375 debye
