program: Orca
programVersion: 5.0.3
elementType: C H C H C C C H H C H H C C H H H H H H H
charge: 1
multiplicity: 1
keywords: b3lyp cc-pVTZ EnGrad RIJCOSX verytightscf cc-pVTZ/C def2/J soscf
formula: C8H13
InChI: InChI=1/C8H13/c1-3-7-5-2-6-8(4-1)9-7/h3,6-8H,1-2,4-5H2
21 atoms
C  -1.991489 0.666107 0.108018
H  -2.177215 0.857683 1.169354
C  -1.831927 -0.936056 -0.129131
H  -2.645607 -1.437143 0.398212
C  -0.458382 -1.337146 0.390294
C  0.684622 -1.269182 -0.370592
C  1.993751 -0.665785 0.096619
H  2.183903 -0.867242 1.155348
H  2.848597 -1.011249 -0.487549
C  1.833603 0.936029 -0.127359
H  1.925612 1.158561 -1.19518
H  2.645725 1.436381 0.403155
C  0.458114 1.326783 0.397785
C  -0.68806 1.278683 -0.360054
H  0.543449 -1.253497 -1.455015
H  -1.926389 -1.148787 -1.198705
H  0.001982 -0.000369 0.091094
H  -0.553799 1.284588 -1.445293
H  -2.850876 1.012313 -0.46897
H  0.347706 1.331269 1.485248
H  -0.346249 -1.361922 1.47723
totalener: -312.18438386 hartree
nucrepener: 382.87457729 hartree
electener: -695.05896114 hartree
oneelecener: -1166.25600655 hartree
twoeener: 471.19704541 hartree
kineticenergy: 309.94849212 hartree
exchangeener: -36.296686103351 hartree
correlationener: -2.309338923640 hartree
xcener: -38.606025026991 hartree
chargesum: 1.0000000
charge: -0.195902 0.144703 -0.200544 0.158524 -0.044338 -0.028903 -0.195576 0.144396 0.158770 -0.200210 0.142679 0.158356 -0.044288 -0.029414 0.155358 0.142959 0.101864 0.156224 0.158856 0.157850 0.158638
charge: 0.112518 -0.004433 0.115846 0.000425 0.133565 0.148852 0.112550 -0.004523 0.001045 0.115868 -0.005065 0.000306 0.132320 0.150143 0.001337 -0.004995 -0.011058 0.000860 0.001119 0.001925 0.001396
qa: -0.1959 0.1447 -0.2005 0.1585 -0.0443 -0.0289 -0.1956 0.1444 0.1588 -0.2002 0.1427 0.1584 -0.0443 -0.0294 0.1554 0.1430 0.1019 0.1562 0.1589 0.1578 0.1586
va: 3.8487 0.9883 3.8565 0.9814 3.7661 3.7647 3.8487 0.9884 0.9811 3.8567 0.9891 0.9815 3.7670 3.7643 0.9939 0.9890 1.1097 0.9933 0.9810 0.9946 0.9940
energy: -312.184383855386
dipole: -0.00292 -0.00219 -0.00511 0.00124 -0.00179 -0.00055 -0.06616 0.05371 -0.01245
magnitude: 0.01347 au
magnitude: 0.03424 debye
