program: Gaussian 09
title: 000050974
version: EM64L-G09RevD.01
frameworkgroup: C1[X(C8H14N2O5)]
method: RPBEPBE
basis: SDD
operation: Freq
keyword: #p
keyword: freq=noraman
keyword: PBEPBE/SDD
title: #p freq=noraman PBEPBE/SDD
converged: YES YES NO NO
title: Mulliken charges:
elementType: O O O O O N N C C C C C C C C H H H H H H H H H H H H H H
charge: -0.257657 -0.231920 -0.249261 -0.245866 -0.256474 -0.066750 0.070221 -0.389911 -0.330602 -0.260817 -0.318873 0.290716 0.310128 -0.750671 -0.743292 0.238737 0.225873 0.241866 0.231760 0.235555 0.228440 0.256125 0.268169 0.249217 0.248415 0.246668 0.255703 0.256046 0.248455
chargesum: 0.00000
title: Mulliken charges with hydrogens summed into heavy atoms:
elementType: O O O O O N N C C C C C C C C
charge: -0.257657 -0.231920 -0.249261 -0.245866 -0.256474 -0.066750 0.070221 0.074699 0.143024 0.203178 0.205421 0.290716 0.310128 -0.006372 0.016912
polarizability: 1.47628677e+02 1.41600202e+01 1.23995209e+02 -7.50827970e-02 2.07164881e+00 9.43966716e+01
1716.lowfreq: -26.4187 -12.2799 -5.8420 -3.6087 0.0007 0.0008 0.0009 15.9716 24.4427
frequency: -26.3734 15.8261 24.2773 34.0505 52.4628 56.8725 60.3113 85.4300 88.3127 105.6737 149.2115 186.0181 195.8080 223.8310 253.4110 279.9205 329.1700 358.0968 396.1528 432.6371 453.7874 525.3556 566.2202 575.3270 610.8605 626.2037 675.7162 759.8454 775.9277 824.8865 842.0599 853.0408 879.1167 932.0510 951.0509 984.3907 1005.8684 1042.3624 1043.9903 1048.1567 1051.3779 1091.2079 1148.6729 1188.5013 1203.9711 1208.8179 1232.5712 1272.6935 1288.6665 1297.5450 1339.9688 1356.0014 1369.1124 1378.9621 1385.5366 1387.0657 1393.4309 1426.0073 1451.6699 1452.8420 1453.1002 1454.9474 1462.3058 1470.4082 1485.5871 1649.5681 1653.7981 2998.7866 3002.4741 3008.7652 3010.3985 3015.2662 3053.6768 3056.5686 3065.3198 3091.2209 3097.2976 3098.5760 3133.2942 3144.3746 3145.9782
redmass: 1.0369 5.2807 7.5871 4.7922 1.4564 4.6085 2.7487 4.0348 2.0620 3.4162 5.8987 3.2121 5.6115 5.9038 4.1526 5.6533 4.9486 2.5319 3.2997 3.4318 3.3240 4.6680 3.0122 3.4916 5.1579 4.5510 4.7256 1.1762 3.9695 5.8415 2.9603 2.4211 2.9734 4.8129 3.8287 1.8895 2.4182 1.6653 1.6923 2.3024 2.8095 3.1770 1.6866 3.0627 3.3032 1.4326 2.5599 1.2267 1.1769 1.3711 1.3118 1.6504 1.6293 1.2901 1.3200 1.3411 1.7568 1.1911 1.0642 1.0470 1.0616 1.0475 1.0830 1.0828 1.0868 8.5855 9.3220 1.0575 1.0598 1.0370 1.0370 1.0578 1.1033 1.0551 1.1044 1.1067 1.0971 1.0969 1.1098 1.1010 1.1013
irintensity: 1.1627 0.3053 2.1444 2.1583 1.6319 0.8925 1.9177 3.8391 0.4632 1.6821 8.3429 6.9848 10.4857 3.4166 0.9764 2.9427 1.7453 1.3200 13.9081 7.4773 9.1411 16.2734 2.5902 7.8754 3.8581 2.0437 5.1625 17.1955 14.2072 37.1936 69.0461 86.8975 215.6925 122.0621 4.7584 80.6312 98.4107 10.9263 10.0070 21.0780 36.2744 9.7437 49.2569 210.1307 405.0197 12.1725 10.8278 2.4553 1.4713 26.7744 6.6233 45.6592 46.2626 32.3003 9.2681 52.9218 50.0165 38.0864 35.6123 15.0429 31.3110 18.3746 4.5792 4.4606 16.3380 191.1061 189.0615 9.5171 6.6489 2.1768 0.9729 37.1621 4.6247 16.5542 1.8470 38.0611 8.6611 4.7068 5.3013 10.3692 7.7187
temp: 298.150 k
press: 1.00000 atm
elementType: 8 8 8 8 8 7 7 6 6 6 6 6 6 6 6 1 1 1 1 1 1 1 1 1 1 1 1 1 1
symmnumber: 1
zpe: 590835.8 jmol-1
zpe.correction: 0.225037 hartree
zpe.thermalcorrener: 0.242050 hartree
zpe.thermalcorrenthalpy: 0.242995 hartree
zpe.thermalcorrgfe: 0.175756 hartree
zpe.sumelectzpe: -797.628182 hartree
zpe.sumelectthermal: -797.611169 hartree
zpe.sumelectthermalent: -797.610225 hartree
zpe.sumelectthermalfe: -797.677464 hartree
dipole: -0.0724 2.4691 -1.7196
dipole: 3.0098
quadrupole: -92.3950 -95.8425 -87.5182
quadrupole: -19.0222 -10.4095 1.7273
quadrupole: -0.4765 -3.9239 4.4004 -19.0222 -10.4095 1.7273
hfenergy: -797.8532195 hartree
pointgroup: C01[X(C8H14N2O5)]
dipole: -0.2152836 0.5780525 -1.0107926 debye
polarizability: 142.4072291|14.4472416|123.7139208|-9.7880271|-12.5593699|99.8994081 unknown
InChI: InChI=1S/C8H14N2O5/c1-7(11)14-5-3-4-10(9-13)6-15-8(2)12/h3-6H2,1-2H3
charge 0 multiplicity 1
29 atoms
O  3.167489 0.109613 -0.537677
O  -3.190761 0.046243 -0.013435
O  -2.665846 -2.995728 1.59669
O  4.597939 1.521887 0.641515
O  -1.658207 1.589695 -0.86813
N  -1.347631 -1.284965 0.896796
N  -1.624446 -2.298944 1.841197
C  0.945388 -0.563457 0.134823
C  -0.15929 -0.466055 1.210626
C  2.164463 0.261597 0.553056
C  -2.19935 -1.053312 -0.253484
C  4.369695 0.811293 -0.362446
C  -2.791405 1.340018 -0.39803
C  5.298456 0.566011 -1.531067
C  -3.914357 2.322668 -0.167385
H  0.573999 -0.17383 -0.829925
H  1.242904 -1.61845 -0.006317
H  0.204859 -0.83912 2.184765
H  -0.463432 0.589753 1.33611
H  1.923983 1.334952 0.667328
H  2.613239 -0.094853 1.499216
H  -1.593313 -0.793445 -1.135006
H  -2.825631 -1.945425 -0.403015
H  4.787671 0.795156 -2.48156
H  5.590956 -0.498334 -1.563442
H  6.197212 1.190229 -1.426203
H  -4.769724 2.075133 -0.820285
H  -4.271112 2.257287 0.874385
H  -3.567549 3.34248 -0.386202
