program: Orca
programVersion: 5.0.3
elementType: C H C H C C C H H C H H C C H H H H H H H
charge: 1
multiplicity: 1
keywords: DSD-PBEP86 cc-pVTZ EnGrad D3BJ RIJCOSX verytightscf cc-pVTZ/C def2/J soscf
formula: C8H13
InChI: InChI=1/C8H13/c1-2-4-6-8-7-5-3-1/h1-2,7H,3-6,8H2
21 atoms
C  -1.997068 0.531378 0.120048
H  -2.174447 0.723357 1.18181
C  -1.950467 -0.995568 -0.171029
H  -2.675345 -1.587052 0.390743
C  -0.51469 -1.148184 0.284325
C  0.611875 -1.129137 -0.501871
C  1.907957 -0.653926 0.065829
H  2.010142 -0.952114 1.114664
H  2.764575 -1.044316 -0.490401
C  1.891057 0.910553 -0.038479
H  2.01188 1.201212 -1.088721
H  2.73957 1.329086 0.509212
C  0.555208 1.481576 0.491797
C  -0.553791 0.840107 -0.26694
H  0.5316 -1.302295 -1.574635
H  -2.062739 -1.203081 -1.239342
H  0.437385 1.353161 1.572587
H  -0.425437 0.902643 -1.35049
H  -2.721902 1.094447 -0.476836
H  0.530504 2.564107 0.284922
H  -0.365353 -1.097432 1.36419
totalener: -311.14888560 hartree
nucrepener: 385.20427933 hartree
electener: -696.35316493 hartree
oneelecener: -1170.64915915 hartree
twoeener: 474.29599422 hartree
kineticenergy: 309.74017104 hartree
exchangeener: -13.670951736518 hartree
correlationener: -0.926014108829 hartree
xcener: -14.596965845346 hartree
chargesum: 1.0000000
charge: -0.218960 0.168253 -0.233228 0.183648 -0.066897 -0.071666 -0.249523 0.164109 0.182769 -0.248011 0.158936 0.181981 -0.233187 -0.055912 0.223211 0.166872 0.164526 0.204101 0.182850 0.197845 0.198284
charge: 0.094917 0.000123 0.099405 -0.000728 0.127162 0.157398 0.080948 0.001114 0.006439 0.097783 -0.006266 -0.000241 0.064444 0.240927 0.000567 -0.000116 -0.000908 0.002910 0.001724 0.024681 0.007717
qa: -0.2190 0.1683 -0.2332 0.1836 -0.0669 -0.0717 -0.2495 0.1641 0.1828 -0.2480 0.1589 0.1820 -0.2332 -0.0559 0.2232 0.1669 0.1645 0.2041 0.1829 0.1978 0.1983
va: 3.8673 0.9856 3.8862 0.9766 3.8036 3.7958 3.9215 0.9842 0.9765 3.8914 0.9818 0.9725 3.8996 3.7251 0.9610 0.9865 0.9839 0.9749 0.9749 0.9674 0.9777
dispcorr: -0.011652386 hartree
energy: -311.854326673919
dipole: 0.56268 -0.74547 -0.18279 1.85503 -1.72307 0.13196 0.18512 -0.33548 -0.15037
magnitude: 0.27099 au
magnitude: 0.68880 debye
