program: Gaussian 09
title: 000051218
version: EM64L-G09RevD.01
frameworkgroup: C1[X(C22H21N3O6)]
method: RPBEPBE
basis: SDD
operation: Freq
keyword: #p
keyword: freq=noraman
keyword: PBEPBE/SDD
title: #p freq=noraman PBEPBE/SDD
converged: YES YES NO NO
title: Mulliken charges:
elementType: O O O O O O N N N C C C C C C C C C C C C C C C C C C C C C C H H H H H H H H H H H H H H H H H H H H H
charge: -0.202479 -0.229069 -0.237163 -0.255028 -0.427276 -0.316245 -0.198023 -0.184212 -0.465866 -0.018545 -0.385411 0.128362 0.155785 0.404538 0.250968 -0.726150 -0.535506 -0.361097 -0.375439 -0.600821 -0.259524 -0.250976 0.263850 -0.244702 0.351528 0.040145 -0.327622 -0.296003 -0.212451 -0.242155 0.164194 0.229751 0.245335 0.231420 0.223669 0.233582 0.295672 0.271188 0.262431 0.299298 0.258781 0.266372 0.248876 0.227015 0.231120 0.229304 0.380982 0.313115 0.277992 0.236001 0.238215 0.392275
chargesum: 0.00000
title: Mulliken charges with hydrogens summed into heavy atoms:
elementType: O O O O O O N N N C C C C C C C C C C C C C C C C C C C C C C
charge: -0.202479 -0.229069 -0.237163 -0.255028 -0.035001 -0.316245 -0.198023 -0.184212 -0.084884 -0.018545 0.089676 0.128362 0.155785 0.404538 0.250968 -0.037480 0.031354 -0.098666 -0.076141 0.173208 -0.032510 -0.019856 0.263850 -0.015398 0.351528 0.040145 -0.014507 -0.018010 0.023551 -0.003941 0.164194
polarizability: 3.76436122e+02 4.26061353e+00 2.97788888e+02 -5.92177495e+00 1.20829121e+01 1.81006134e+02
1716.lowfreq: -9.2231 -7.6142 -5.6664 -0.0003 0.0003 0.0005 5.8722 12.8471 26.1832
frequency: -2.5757 12.7738 26.0081 34.0359 41.1052 55.7170 64.4509 68.7116 73.9860 92.6300 95.1722 112.2251 116.9061 121.4046 135.5143 151.0378 170.3861 206.5227 211.7367 225.4711 250.4350 263.6266 268.4322 284.0432 306.0636 312.1178 316.4858 328.8180 357.0035 365.6823 388.8625 394.2306 399.9484 409.3190 421.1740 445.1138 449.1964 493.0928 506.9905 512.9059 524.2198 560.7033 581.5070 584.0265 604.4368 613.1173 614.8348 657.9924 681.0301 687.6556 694.8849 701.6857 708.6240 717.5598 733.6614 763.5752 766.9225 768.0041 785.8182 790.5195 831.5465 844.3977 851.7828 902.6498 906.6331 913.0642 922.9716 926.8368 938.8730 950.5176 979.1285 984.0111 988.7872 997.4684 1005.3227 1010.3857 1019.2208 1030.1320 1035.2641 1043.4731 1062.2099 1085.1507 1093.4540 1111.6647 1129.4726 1134.5615 1147.9793 1162.4626 1164.5202 1175.6725 1179.6952 1187.0895 1195.8002 1210.9477 1243.3560 1250.3520 1290.0034 1298.9212 1308.0730 1328.7696 1332.3526 1339.0472 1345.3416 1359.8853 1368.7450 1378.4209 1389.4079 1392.2882 1415.1167 1428.6161 1435.9467 1439.0353 1445.9907 1467.0549 1470.8223 1482.6565 1482.9030 1485.3566 1486.3662 1524.6178 1585.1686 1588.5432 1590.1880 1593.2689 1594.4032 1605.7053 1625.2753 1649.1703 1657.9912 2984.9729 3018.5545 3020.8667 3032.0520 3074.3952 3080.6731 3093.3091 3104.4642 3112.4318 3125.8338 3136.4317 3140.9010 3147.4557 3148.4181 3155.1397 3161.3157 3166.0819 3183.5006 3196.9421 3224.3660 3531.4585
redmass: 6.2775 6.1184 4.8620 6.2061 4.7174 4.8895 1.1546 5.4228 7.0072 5.4708 3.7996 4.8254 5.8280 3.0752 7.3539 6.1130 7.1012 1.6472 3.1534 4.0889 6.7783 4.9668 4.9493 3.2292 2.4590 2.7104 7.6705 3.6284 6.8814 3.6624 8.8671 8.5167 2.8588 7.6355 3.1690 7.3997 6.4649 5.3089 3.9555 3.5575 6.0598 3.5794 5.7595 1.2189 5.2592 7.0046 6.7806 6.8236 4.6397 4.2379 3.9789 2.4262 6.9710 2.8747 6.0746 2.5699 5.0248 1.9284 1.8777 1.7118 5.2154 3.7689 1.2535 1.3122 1.5725 2.1438 2.5322 2.1511 3.4666 2.2590 1.3962 1.3686 4.3560 1.4665 2.9918 1.3276 5.3271 2.5604 2.7080 2.1769 2.5843 2.2288 1.6972 1.8965 1.3568 2.6918 3.1089 2.8119 1.6850 1.0920 1.1197 2.9423 3.1151 1.1892 3.7654 1.7277 1.8816 1.3815 1.9447 1.9307 1.8241 1.4392 2.1441 2.4599 2.1507 5.5744 8.9539 1.2207 1.1245 1.3131 2.1924 2.5113 1.0932 2.6789 1.0775 1.0512 1.0678 1.7980 1.1107 3.0892 6.9658 8.0524 6.2372 5.8897 7.5953 5.7607 7.9994 5.8900 2.8459 1.0357 1.0333 1.0588 1.0608 1.1002 1.0977 1.1029 1.1036 1.1022 1.0848 1.0883 1.0877 1.0927 1.1024 1.0961 1.0926 1.1016 1.0967 1.0954 1.0822 1.0642
irintensity: 0.2621 0.0511 0.2430 0.5745 0.7113 1.0106 0.2882 0.1482 2.3194 1.2622 0.7504 6.2560 1.7851 0.5264 0.6087 0.0416 6.6878 0.5867 3.8377 7.2337 1.7299 4.3205 4.7958 1.3366 5.4611 2.8566 1.5544 2.2699 4.7567 8.0614 31.4319 14.2805 0.3323 14.7549 12.6591 9.5675 28.0753 33.6153 10.5469 6.6088 4.2177 5.0985 1.0085 112.9785 53.1509 3.1409 4.1787 4.4746 1.7067 50.8933 9.1789 41.7131 10.1318 11.5378 7.7186 36.2285 14.2145 37.2301 0.7136 39.9682 16.0077 1.1696 1.5893 25.9239 11.9110 33.2590 29.9030 5.8363 27.5763 24.9630 1.0885 3.5617 2.4568 0.5649 4.2291 2.0479 256.6721 16.5859 15.0727 49.0404 39.2819 4.1762 3.8536 181.5327 2.9185 10.4387 9.0141 41.6601 113.6185 1.4320 0.3593 31.8934 102.1310 0.5567 54.8119 5.4957 138.8877 98.9099 54.3916 267.3210 124.7207 4.6433 27.4036 131.1257 187.4431 0.3811 34.6862 16.7835 74.6030 204.9005 7.3719 46.6405 33.2167 27.2541 18.2911 4.4423 22.6267 21.3169 17.8512 582.8137 58.6918 583.4300 24.0394 89.9296 538.4211 21.1338 191.2966 3.1801 23.4603 28.4733 22.6164 34.4121 10.9062 8.7161 39.4781 3.5495 17.7788 12.3288 0.1862 23.5510 6.2790 20.7414 0.6504 1.7904 12.2706 36.8127 5.7768 12.1976 263.0266 75.9660
temp: 298.150 k
press: 1.00000 atm
elementType: 8 8 8 8 8 8 7 7 7 6 6 6 6 6 6 6 6 6 6 6 6 6 6 6 6 6 6 6 6 6 6 1 1 1 1 1 1 1 1 1 1 1 1 1 1 1 1 1 1 1 1 1
symmnumber: 1
zpe: 1044770.5 jmol-1
zpe.correction: 0.397932 hartree
zpe.thermalcorrener: 0.425490 hartree
zpe.thermalcorrenthalpy: 0.426434 hartree
zpe.thermalcorrgfe: 0.338120 hartree
zpe.sumelectzpe: -1464.402234 hartree
zpe.sumelectthermal: -1464.374676 hartree
zpe.sumelectthermalent: -1464.373731 hartree
zpe.sumelectthermalfe: -1464.462046 hartree
dipole: -3.6227 -0.0764 0.6648
dipole: 3.6840
quadrupole: -153.7725 -163.1506 -187.6720
quadrupole: 2.8962 3.6030 5.1555
quadrupole: 14.4258 5.0478 -19.4736 2.8962 3.6030 5.1555
hfenergy: -1464.8001656 hartree
pointgroup: C01 [X(C22H21N3O6)]
dipole: -1.385206 0.1697021 -0.391337 debye
polarizability: 371.8353634|-12.6349463|300.3576725|24.4510138|4.991219|183.0381078 unknown
InChI: InChI=1S/C22H21N3O6/c1-3-22(14-9-5-4-6-10-14)19(29)24(2)21(31)25(20(22)30)13-17(26)23-16-12-8-7-11-15(16)18(27)28/h4-12,23,27H,3,13H2,1-2H3
charge 0 multiplicity 1
52 atoms
O  1.332678 0.536751 2.499302
O  4.860279 0.893663 -0.720745
O  0.427672 1.633651 -1.928956
O  -1.025154 -0.940497 0.157516
O  -6.583077 2.476302 -0.40164
O  -4.337338 2.803556 0.015268
N  0.900787 1.110309 0.293799
N  2.640588 1.141525 -1.37137
N  -2.749847 0.666465 0.04665
C  3.16475 0.189504 0.907641
C  4.148512 0.598431 2.052975
C  1.748487 0.621203 1.31478
C  3.63917 0.794486 -0.430756
C  3.198479 -1.362058 0.690915
C  1.273635 1.29081 -1.06179
C  4.22373 2.117295 2.311083
C  -0.500494 1.414252 0.62787
C  4.445617 -1.981478 0.414085
C  2.028837 -2.159427 0.752617
C  3.034872 1.46449 -2.764862
C  4.525717 -3.378205 0.234165
C  2.116266 -3.558982 0.571685
C  -1.43881 0.251515 0.2367
C  3.360759 -4.175799 0.318551
C  -3.885834 -0.121236 -0.243364
C  -5.163501 0.532573 -0.387342
C  -3.813486 -1.533212 -0.399115
C  -6.319507 -0.243195 -0.678377
C  -4.976179 -2.272017 -0.68646
C  -6.235062 -1.636589 -0.827804
C  -5.285609 1.994366 -0.238397
H  5.150019 0.221868 1.787973
H  3.814921 0.073226 2.964726
H  4.573859 2.663018 1.416234
H  4.94123 2.323311 3.125378
H  3.246742 2.527765 2.62346
H  -0.54177 1.546054 1.724251
H  -0.800788 2.348616 0.126392
H  5.34955 -1.37153 0.313764
H  1.044789 -1.713188 0.926683
H  2.455392 0.841208 -3.463598
H  4.110893 1.261393 -2.857488
H  2.831488 2.524868 -2.986965
H  5.496222 -3.841009 0.023114
H  1.203083 -4.161848 0.625338
H  3.422671 -5.261069 0.180514
H  -2.961174 1.683013 0.106347
H  -2.843837 -2.022152 -0.29526
H  -7.276109 0.275048 -0.783265
H  -4.897431 -3.358596 -0.803126
H  -7.131313 -2.222902 -1.052057
H  -6.572771 3.464655 -0.289841
