program: Orca
programVersion: 5.0.3
elementType: C H C H C C C H H C H H C C H H H H H H H
charge: 1
multiplicity: 1
keywords: b3lyp cc-pVTZ EnGrad RIJCOSX verytightscf cc-pVTZ/C def2/J soscf
formula: C8H13
InChI: InChI=1/C8H13/c1-2-4-6-8-7-5-3-1/h1-2,7H,3-6,8H2
21 atoms
C  -1.993731 0.542917 0.116685
H  -2.169328 0.730384 1.17987
C  -1.916595 -0.98534 -0.174085
H  -2.671379 -1.563779 0.36289
C  -0.4939 -1.200301 0.300882
C  0.621676 -1.163929 -0.487783
C  1.913745 -0.666894 0.069986
H  2.030603 -0.950456 1.12135
H  2.777913 -1.041283 -0.486484
C  1.868352 0.893629 -0.055685
H  1.960081 1.172481 -1.112266
H  2.72004 1.338571 0.46612
C  0.539552 1.477009 0.501445
C  -0.588693 0.938691 -0.286293
H  0.533556 -1.30894 -1.564343
H  -2.011356 -1.184745 -1.24602
H  0.412613 1.303903 1.574436
H  -0.453185 1.020859 -1.367982
H  -2.754035 1.066339 -0.473836
H  0.570449 2.570174 0.344334
H  -0.349433 -1.159668 1.38213
totalener: -312.24399678 hartree
nucrepener: 383.52363496 hartree
electener: -695.76763175 hartree
oneelecener: -1167.97705742 hartree
twoeener: 472.20942568 hartree
kineticenergy: 309.98831688 hartree
exchangeener: -36.312787786504 hartree
correlationener: -2.306880371168 hartree
xcener: -38.619668157673 hartree
chargesum: 1.0000000
charge: -0.164462 0.142971 -0.167132 0.153038 -0.057805 -0.073281 -0.183984 0.134512 0.153231 -0.187405 0.130368 0.152954 -0.164854 -0.003462 0.182367 0.137728 0.138802 0.185050 0.155493 0.174217 0.161654
charge: 0.093384 0.000024 0.097313 -0.002014 0.124282 0.128534 0.080820 -0.000960 0.005313 0.104096 -0.007321 -0.001378 0.070437 0.277984 -0.006968 -0.001119 -0.000097 0.003972 0.003958 0.030931 -0.001192
qa: -0.1645 0.1430 -0.1671 0.1530 -0.0578 -0.0733 -0.1840 0.1345 0.1532 -0.1874 0.1304 0.1530 -0.1649 -0.0035 0.1824 0.1377 0.1388 0.1850 0.1555 0.1742 0.1617
va: 3.8215 0.9907 3.8403 0.9830 3.7766 3.7785 3.8726 0.9913 0.9832 3.8352 0.9886 0.9802 3.8512 3.6297 0.9797 0.9930 0.9913 0.9836 0.9817 0.9746 0.9928
energy: -312.243996782393
dipole: 0.55903 -0.79580 -0.23677 1.86640 -1.47534 0.39106 0.16869 -0.30019 -0.13150
magnitude: 0.47569 au
magnitude: 1.20912 debye
