program: Orca
programVersion: 5.0.3
elementType: C H C H C C C H H C H H C C H H H H H H H
charge: 1
multiplicity: 1
keywords: DSD-PBEP86/2013 def2-TZVP D3BJ RIJCOSX verytightscf def2-TZVP/C def2/J soscf noTRAH
formula: C8H13
InChI: InChI=1/C8H13/c1-2-4-6-8-7-5-3-1/h1-2,7H,3-6,8H2
21 atoms
C  -1.99451 0.517582 0.087598
H  -2.189923 0.763012 1.134798
C  -1.998643 -1.019236 -0.135973
H  -2.683229 -1.590202 0.492009
C  -0.54391 -1.087274 0.283739
C  0.579305 -1.064434 -0.524473
C  1.901018 -0.629277 0.031275
H  2.009346 -0.981426 1.062782
H  2.726904 -1.033987 -0.559314
C  1.934334 0.937602 0.008045
H  2.127688 1.280625 -1.014591
H  2.754668 1.300314 0.632796
C  0.570538 1.471941 0.485262
C  -0.497134 0.711295 -0.255389
H  0.485203 -1.270741 -1.589745
H  -2.147681 -1.286969 -1.185659
H  0.445422 1.379775 1.569502
H  -0.38151 0.801875 -1.338879
H  -2.655984 1.102567 -0.556763
H  0.472509 2.537071 0.233981
H  -0.373995 -1.036985 1.359903
totalener: -311.17754527 hartree
nucrepener: 387.46907403 hartree
electener: -698.64661931 hartree
oneelecener: -1175.15603380 hartree
twoeener: 476.50941450 hartree
kineticenergy: 310.05372879 hartree
exchangeener: -14.135459914241 hartree
correlationener: -0.950048872963 hartree
xcener: -15.085508787204 hartree
chargesum: 1.0000000
charge: -0.195326 0.163459 -0.193412 0.177626 -0.057919 -0.036869 -0.223815 0.159634 0.176820 -0.237878 0.152346 0.170788 -0.213569 -0.053734 0.210928 0.158956 0.145152 0.168382 0.172793 0.173175 0.182462
charge: -0.180123 0.152526 -0.176956 0.149414 -0.056180 0.004185 -0.199986 0.156050 0.157294 -0.207201 0.146085 0.150293 -0.221970 -0.008871 0.168000 0.151763 0.149357 0.174989 0.147980 0.166459 0.176893
qa: -0.1953 0.1635 -0.1934 0.1776 -0.0579 -0.0369 -0.2238 0.1596 0.1768 -0.2379 0.1523 0.1708 -0.2136 -0.0537 0.2109 0.1590 0.1452 0.1684 0.1728 0.1732 0.1825
va: 3.8739 0.9744 3.8799 0.9725 3.8449 3.7646 3.9046 0.9667 0.9682 3.8880 0.9710 0.9693 3.9224 3.7574 0.9405 0.9738 0.9730 0.9632 0.9710 0.9679 0.9582
total: -311.832912407 hartree
dispcorr: -0.013675387 hartree
energy: -311.846587794412
dipole: 0.55236 -0.70008 -0.14772 1.83929 -1.97232 -0.13303 0.22554 -0.42156 -0.19603
magnitude: 0.27919 au
magnitude: 0.70964 debye
