program: Gaussian 09
title: 000051019
version: EM64L-G09RevD.01
frameworkgroup: C1[X(C13H19NO5)]
method: RPBEPBE
basis: SDD
operation: Freq
keyword: #p
keyword: freq=noraman
keyword: PBEPBE/SDD
title: #p freq=noraman PBEPBE/SDD
converged: YES YES NO NO
title: Mulliken charges:
elementType: O O O O O N C C C C C C C C C C C C C H H H H H H H H H H H H H H H H H H H
charge: -0.275974 -0.274286 -0.314409 -0.253038 -0.274605 -0.607634 -0.327004 -0.261868 -0.293255 -0.225868 0.254851 0.190764 -0.331236 -0.338555 -0.262085 -0.303639 -0.258596 0.149434 -0.538489 0.206675 0.215083 0.204258 0.236650 0.192843 0.266327 0.185550 0.210912 0.254349 0.245578 0.231175 0.219274 0.234416 0.228929 0.245460 0.223352 0.222488 0.389825 0.332348
chargesum: 0.00000
title: Mulliken charges with hydrogens summed into heavy atoms:
elementType: O O O O O N C C C C C C C C C C C C C
charge: -0.275974 -0.274286 -0.314409 -0.253038 -0.274605 0.114539 0.094754 0.179041 0.165915 0.170594 0.254851 0.190764 -0.076887 -0.092977 -0.030910 0.150052 -0.029667 0.149434 0.152811
polarizability: 1.64992906e+02 2.54358170e+01 1.64769058e+02 -1.74777542e+00 -8.34714860e+00 1.62660281e+02
1716.lowfreq: -11.1002 -0.0007 -0.0006 -0.0003 2.5102 3.0906 8.3001 29.9976 32.5353
frequency: 8.1582 29.8876 32.5175 37.2965 46.8006 65.3629 95.2300 101.7922 111.1706 115.4690 138.1201 171.4715 186.6555 229.4188 238.4915 263.4188 287.6324 303.3706 315.9019 322.7037 339.3827 416.4399 456.3666 460.4835 495.5500 513.8505 518.4491 540.2947 557.1145 562.3086 594.1114 653.1010 675.0514 722.5243 732.6068 745.8260 757.5463 783.6141 831.0210 838.0960 870.5772 894.9743 902.5698 919.0766 959.2399 982.8526 988.4626 1000.1452 1011.6217 1027.8716 1045.3362 1057.1348 1061.5587 1071.0766 1099.9715 1110.5904 1114.6240 1124.6052 1150.2297 1172.2099 1189.8949 1198.3477 1204.6822 1219.5312 1243.8461 1256.6735 1274.5694 1278.9357 1316.9334 1354.7726 1358.7928 1366.4441 1377.2108 1395.4604 1398.1959 1426.2176 1440.6787 1444.5155 1447.4085 1448.8171 1463.3434 1465.9016 1468.5124 1470.6654 1494.4893 1569.2627 1592.6504 1597.8307 1649.1061 2932.2565 2949.1707 2954.1828 2959.2838 2965.1052 2973.7805 2996.6522 3006.9601 3034.7738 3047.4100 3059.1619 3065.6520 3126.8260 3136.0432 3151.4626 3165.0826 3175.2699 3496.1718 3659.1818
redmass: 4.7740 4.9846 4.9855 5.1377 5.8779 5.1438 3.8116 4.3947 3.3137 2.9492 3.4975 3.1521 3.4254 3.1021 1.4476 3.7555 2.4262 3.3566 3.1308 2.6469 4.0157 4.1776 3.2980 4.0243 4.0203 2.3428 1.9482 3.0354 4.1440 4.3494 5.0759 1.5611 1.1101 3.8027 4.3933 1.2835 2.9864 4.7019 1.4704 2.8427 3.1616 2.9896 1.4156 2.6086 1.2895 8.4625 1.9630 3.6100 2.0368 2.9429 2.0993 2.4061 2.0955 3.8631 2.8851 1.2614 2.0389 2.7022 1.4495 1.0636 1.0757 2.1606 1.2162 1.1267 3.0516 1.1406 1.3644 1.2445 1.2448 1.2274 2.8361 1.4437 1.3283 5.9228 1.5743 1.5822 1.4341 1.0996 1.0929 1.1383 1.0871 1.0532 1.0929 1.0874 2.3692 1.3178 6.0226 7.3818 6.1411 1.0573 1.0573 1.0579 1.0332 1.0632 1.0655 1.1030 1.1035 1.1034 1.1040 1.1000 1.0995 1.0993 1.0852 1.0900 1.0931 1.0994 1.0464 1.1028
irintensity: 0.8785 0.3332 0.0807 2.3236 0.7055 4.0523 13.3422 1.8990 3.4851 10.8315 6.2085 2.1049 2.5794 0.8852 0.3120 2.1031 4.4901 0.4296 0.5159 10.4848 2.4646 27.3754 3.1714 1.3188 0.1377 8.9184 10.5020 5.3479 2.1266 2.7305 7.8237 134.2703 24.1370 5.4209 16.6888 105.0381 21.1411 0.2039 0.7890 7.2096 0.7624 28.9372 3.4293 47.2029 0.2231 39.9285 3.5955 53.0270 5.7333 13.6704 18.2878 25.6519 44.8010 84.1694 32.1228 0.3073 96.3484 39.0397 12.2980 1.4168 4.4395 89.7579 29.6438 2.5408 167.9019 15.0136 23.8424 6.9543 20.9948 10.8551 61.5413 7.6917 15.1477 0.2089 16.7875 11.8923 35.0420 9.1078 12.2372 20.5993 19.4703 14.5642 2.0147 51.2123 101.7945 128.2935 52.0262 11.5326 421.0872 31.7081 49.8805 49.1088 54.9038 101.8373 68.8654 56.2862 17.3323 38.3380 48.0527 5.2937 31.6744 20.2675 0.1550 16.1844 22.0686 7.2308 88.2863 37.3896
temp: 298.150 k
press: 1.00000 atm
elementType: 8 8 8 8 8 7 6 6 6 6 6 6 6 6 6 6 6 6 6 1 1 1 1 1 1 1 1 1 1 1 1 1 1 1 1 1 1 1
symmnumber: 1
zpe: 808241.7 jmol-1
zpe.correction: 0.307843 hartree
zpe.thermalcorrener: 0.328111 hartree
zpe.thermalcorrenthalpy: 0.329055 hartree
zpe.thermalcorrgfe: 0.255323 hartree
zpe.sumelectzpe: -936.131279 hartree
zpe.sumelectthermal: -936.111012 hartree
zpe.sumelectthermalent: -936.110068 hartree
zpe.sumelectthermalfe: -936.183799 hartree
dipole: 2.6178 -3.7612 1.5989
dipole: 4.8534
quadrupole: -108.0636 -134.1115 -95.2020
quadrupole: 13.7257 -0.4615 3.1058
quadrupole: 4.3955 -21.6525 17.2570 13.7257 -0.4615 3.1058
hfenergy: -936.4391224 hartree
pointgroup: C01 [X(C13H19N1O5)]
dipole: -1.1120301 0.3124238 1.5204909 debye
polarizability: 146.7702759|13.896463|181.3722449|12.3431825|8.7499926|164.2797243 unknown
InChI: InChI=1S/C13H19NO5/c1-16-11-4-2-3-5-12(11)19-9-8-17-6-7-18-10-13(14)15/h2-5H,6-10,14H2,1H3
charge 0 multiplicity 1
38 atoms
O  1.165036 3.381426 -0.070989
O  -1.08822 1.260646 0.32051
O  2.278666 0.641975 -0.731968
O  -0.807717 -0.722193 2.043769
O  3.257638 -1.922742 -3.127903
N  1.303033 -1.469552 -1.918908
C  -0.288988 3.52101 0.002014
C  -1.042873 2.364139 -0.658059
C  1.762094 2.402726 0.862112
C  2.878421 1.668957 0.131621
C  -1.527909 0.009166 -0.122536
C  -1.379157 -1.067075 0.812476
C  -2.085626 -0.244107 -1.395509
C  -1.794436 -2.367309 0.44877
C  -2.498148 -1.552634 -1.749946
C  3.260426 -0.044076 -1.572418
C  -2.352738 -2.609969 -0.831366
C  2.603952 -1.236137 -2.285602
C  -0.626532 -1.799219 3.020493
H  -0.640273 3.639871 1.048328
H  -0.503872 4.451969 -0.552717
H  -2.07857 2.668695 -0.919646
H  -0.50398 2.044413 -1.571644
H  2.189634 2.954805 1.725117
H  1.007931 1.68001 1.222378
H  3.560743 1.184452 0.865491
H  3.462791 2.390597 -0.477625
H  -2.202627 0.571393 -2.1149
H  -1.682921 -3.197373 1.152496
H  -2.931697 -1.732477 -2.739102
H  4.107175 -0.433208 -0.966371
H  3.675331 0.637108 -2.343803
H  -2.671523 -3.623215 -1.097307
H  -0.165714 -1.315992 3.8942
H  0.045934 -2.588223 2.630701
H  -1.596897 -2.24745 3.310344
H  0.855619 -0.851328 -1.238728
H  0.779493 -2.232579 -2.345072
