program: Orca
programVersion: 5.0.3
elementType: C H C H C C C H H C H H C C H H H H H H H
charge: 1
multiplicity: 1
keywords: PBE0 def2-TZVP EnGrad RIJCOSX verytightscf def2/J soscf
formula: C8H13
InChI: InChI=1/C8H13/c1-2-4-6-8-7-5-3-1/h1-2,7H,3-6,8H2
21 atoms
C  -1.990021 0.563875 0.102712
H  -2.166221 0.74598 1.167816
C  -1.867913 -0.971682 -0.174687
H  -2.662075 -1.52519 0.333196
C  -0.464513 -1.264377 0.328862
C  0.636245 -1.208691 -0.462419
C  1.927516 -0.684158 0.072492
H  2.070436 -0.946591 1.126011
H  2.796115 -1.037823 -0.492235
C  1.841634 0.86967 -0.081631
H  1.901286 1.135466 -1.143724
H  2.687821 1.351672 0.416229
C  0.51158 1.453257 0.510696
C  -0.640955 1.074135 -0.309186
H  0.530066 -1.296692 -1.544413
H  -1.93998 -1.168518 -1.249219
H  0.373509 1.199908 1.565275
H  -0.521723 1.262389 -1.380629
H  -2.792392 1.023043 -0.48595
H  0.612584 2.553675 0.435589
H  -0.330623 -1.258749 1.412117
totalener: -312.06486130 hartree
nucrepener: 381.46619396 hartree
electener: -693.53105526 hartree
oneelecener: -1163.94703172 hartree
twoeener: 470.41597646 hartree
kineticenergy: 310.15893034 hartree
exchangeener: -34.173522582405 hartree
correlationener: -1.965210396620 hartree
xcener: -36.138732979024 hartree
chargesum: 1.0000000
charge: -0.192824 0.168886 -0.207880 0.175505 -0.114088 -0.103242 -0.221180 0.160594 0.172957 -0.248532 0.158516 0.176628 -0.157051 -0.005681 0.170319 0.164264 0.159740 0.197986 0.179844 0.200902 0.164339
charge: -0.207539 0.163600 -0.202714 0.155738 -0.081406 -0.106502 -0.223098 0.158033 0.163742 -0.205291 0.152774 0.157206 -0.224697 0.115715 0.162220 0.158744 0.161802 0.173848 0.165680 0.199652 0.162494
qa: -0.1928 0.1689 -0.2079 0.1755 -0.1141 -0.1032 -0.2212 0.1606 0.1730 -0.2485 0.1585 0.1766 -0.1571 -0.0057 0.1703 0.1643 0.1597 0.1980 0.1798 0.2009 0.1643
va: 3.9019 0.9704 3.8968 0.9693 3.9413 3.9169 3.9502 0.9695 0.9695 3.9440 0.9686 0.9623 3.9240 3.7673 0.9618 0.9734 0.9742 0.9462 0.9680 0.9574 0.9636
energy: -312.064861299237
dipole: 0.52363 -0.85692 -0.33329 1.90836 -1.14957 0.75879 0.14980 -0.27350 -0.12369
magnitude: 0.83794 au
magnitude: 2.12987 debye
